program: Orca
programVersion: 5.0.2
elementType: O O C C C C C C C C C C C C C C C C C H H H H H H H H H H H H H H H H H H H H H H H H H H H H H H
charge: 0
multiplicity: 1
keywords: wb97x-d3
keywords: def2-TZVPP
keywords: def2/J RIJCOSX
keywords: DEFGRID2
keywords: scfconv7
keywords: smallprint printgap noloewdin
keywords: NOSOSCF
formula: C17H30O2
InChI: InChI=1/C17H30O2/c1-6-19-17(18)13-16(5)12-8-11-15(4)10-7-9-14(2)3/h8,12-15H,6-7,9-11H2,1-5H3
49 atoms
O  3.482934 -0.942683 1.170639
O  3.215674 -1.60711 -0.947498
C  -4.16426 -0.219255 0.060627
C  -3.321087 0.974422 0.534777
C  -2.265606 1.468581 -0.451182
C  -1.374664 2.548713 0.153278
C  -0.240765 3.038781 -0.751084
C  -3.516357 -1.572152 0.418719
C  -5.565273 -0.166855 0.661006
C  0.406392 4.28683 -0.160259
C  0.814911 1.96095 -0.982537
C  -2.189785 -1.788294 -0.221397
C  -1.023411 -1.78328 0.432554
C  0.28942 -1.840112 -0.204094
C  0.338124 -2.16534 -1.663432
C  1.351205 -1.525132 0.569291
C  2.746835 -1.381366 0.147332
C  4.875553 -0.682159 0.958119
C  5.114938 0.656178 0.296361
H  -4.263275 -0.166954 -1.030505
H  -2.841436 0.715883 1.486548
H  -3.987711 1.812706 0.763892
H  -2.764732 1.863709 -1.342776
H  -1.654041 0.632966 -0.794369
H  -2.000885 3.402931 0.435096
H  -0.938585 2.176169 1.088707
H  -0.672052 3.309373 -1.722752
H  -4.195299 -2.370517 0.100214
H  -3.42738 -1.644315 1.507072
H  -5.527832 -0.183634 1.753225
H  -6.088339 0.74427 0.365171
H  -6.173587 -1.014779 0.339804
H  0.834999 4.07947 0.82398
H  -0.317165 5.095662 -0.039195
H  1.212631 4.660876 -0.794833
H  1.271175 1.651837 -0.037879
H  0.405108 1.069016 -1.458875
H  1.616895 2.327163 -1.626991
H  -2.202234 -1.903217 -1.301649
H  -1.029231 -1.64125 1.509888
H  -0.280383 -3.037052 -1.879522
H  1.340385 -2.362638 -2.022691
H  -0.070367 -1.336791 -2.247328
H  1.164189 -1.295315 1.612127
H  5.333888 -1.493289 0.389476
H  5.310679 -0.693499 1.956888
H  4.658276 1.467138 0.864877
H  6.188417 0.845482 0.25497
H  4.733337 0.690366 -0.723449
elementType: O C H
totalener: -816.42558759 hartree
nucrepener: 1494.61142029 hartree
electener: -2311.03700788 hartree
oneelecener: -4074.72739949 hartree
twoeener: 1763.69039161 hartree
cpcmener: -0.01664659 hartree
kineticenergy: 812.44026216 hartree
xcener: -82.310747175457 hartree
chargesum: -0.0000000
charge: -0.292611 -0.486819 0.080462 -0.185501 -0.115194 -0.161352 0.101273 -0.127737 -0.307977 -0.296868 -0.323205 -0.092079 -0.177003 0.010974 -0.268017 -0.197023 0.481319 0.037027 -0.258975 0.044336 0.067679 0.080835 0.071621 0.045448 0.073738 0.064049 0.023906 0.089133 0.080026 0.087512 0.089160 0.088867 0.081882 0.087232 0.089324 0.078718 0.085854 0.098589 0.129219 0.111609 0.111190 0.113082 0.106496 0.113085 0.087066 0.106483 0.087112 0.097048 0.089008
qa: -0.2926 -0.4868 0.0805 -0.1855 -0.1152 -0.1614 0.1013 -0.1277 -0.3080 -0.2969 -0.3232 -0.0921 -0.1770 0.0110 -0.2680 -0.1970 0.4813 0.0370 -0.2590 0.0443 0.0677 0.0808 0.0716 0.0454 0.0737 0.0640 0.0239 0.0891 0.0800 0.0875 0.0892 0.0889 0.0819 0.0872 0.0893 0.0787 0.0859 0.0986 0.1292 0.1116 0.1112 0.1131 0.1065 0.1131 0.0871 0.1065 0.0871 0.0970 0.0890
va: 2.1082 2.0088 3.7454 3.9021 3.8551 3.8837 3.8118 3.9419 3.9413 3.9284 3.9551 3.8382 3.8948 3.6591 3.9083 3.7661 4.1428 3.8586 3.9095 1.0212 1.0096 1.0061 1.0165 1.0214 1.0104 1.0126 1.0180 1.0081 1.0125 0.9999 1.0038 1.0047 1.0025 1.0054 1.0053 1.0009 0.9968 1.0070 1.0009 1.0231 0.9991 1.0334 0.9930 1.0353 1.0118 0.9953 1.0040 1.0081 1.0139
dispcorr: -0.023179385 hartree
energy: -816.448766974442
dipole: -13.36903 12.36104 -1.00798 16.44760 -16.05309 0.39451 -1.59039 2.03887 0.44848
magnitude: 1.17166 au
magnitude: 2.97813 debye
