program: Orca
programVersion: 5.0.2
elementType: O O C C C C C C C C C C C C C C C C C H H H H H H H H H H H H H H H H H H H H H H H H H H H H H H
charge: 0
multiplicity: 1
keywords: wb97x-d3
keywords: def2-TZVPP
keywords: def2/J RIJCOSX
keywords: DEFGRID2
keywords: scfconv7
keywords: smallprint printgap noloewdin
keywords: NOSOSCF
formula: C17H30O2
InChI: InChI=1/C17H30O2/c1-6-19-17(18)13-16(5)12-8-11-15(4)10-7-9-14(2)3/h8,12-15H,6-7,9-11H2,1-5H3
49 atoms
O  4.263179 -1.997035 1.357615
O  3.801506 -2.650238 -0.728965
C  -3.563774 -0.191867 -0.113736
C  -2.761671 1.103982 -0.240673
C  -3.338998 2.110379 -1.230853
C  -2.405889 3.28503 -1.516502
C  -2.05316 4.165968 -0.315494
C  -2.800546 -1.233961 0.720195
C  -4.943215 0.045926 0.488717
C  -1.051428 5.239477 -0.726505
C  -3.290643 4.800886 0.308163
C  -1.528655 -1.668674 0.075814
C  -0.318232 -1.594291 0.639312
C  0.932619 -2.002225 0.0029
C  0.857576 -2.505109 -1.403628
C  2.058077 -1.885441 0.740777
C  3.427746 -2.222504 0.341493
C  5.660917 -2.252382 1.167329
C  6.364452 -1.109505 0.470714
H  -3.698793 -0.608916 -1.120059
H  -1.740098 0.863749 -0.555063
H  -2.669804 1.55655 0.753354
H  -4.307448 2.480539 -0.883543
H  -3.540745 1.59657 -2.176873
H  -1.478375 2.895639 -1.951376
H  -2.85695 3.917408 -2.290048
H  -1.572571 3.541345 0.446064
H  -3.443888 -2.112968 0.843941
H  -2.607859 -0.842007 1.723752
H  -5.541069 0.729912 -0.114898
H  -5.505975 -0.886146 0.571261
H  -4.866237 0.473753 1.49181
H  -0.756284 5.858119 0.12357
H  -1.472176 5.904882 -1.485121
H  -0.141905 4.801448 -1.143136
H  -3.83749 5.399094 -0.425927
H  -3.983189 4.05719 0.706084
H  -3.022309 5.462273 1.134536
H  -1.631177 -2.064657 -0.931132
H  -0.235362 -1.198012 1.647881
H  0.400604 -1.75243 -2.048707
H  0.219774 -3.389922 -1.454971
H  1.823774 -2.762677 -1.818523
H  1.960032 -1.503985 1.751023
H  5.807528 -3.19216 0.632217
H  6.054906 -2.381982 2.174731
H  6.235747 -0.172676 1.013825
H  7.433411 -1.323019 0.428026
H  6.015287 -0.968282 -0.551691
elementType: O C H
totalener: -816.42888122 hartree
nucrepener: 1397.84586727 hartree
electener: -2214.27474849 hartree
oneelecener: -3881.01628428 hartree
twoeener: 1666.74153579 hartree
cpcmener: -0.01632729 hartree
kineticenergy: 812.44049683 hartree
xcener: -82.311144603273 hartree
chargesum: -0.0000000
charge: -0.293446 -0.487232 0.088286 -0.181176 -0.138763 -0.186835 0.064241 -0.113494 -0.317033 -0.296408 -0.302181 -0.138678 -0.153524 0.022453 -0.265752 -0.179714 0.472724 0.039616 -0.256390 0.039272 0.082321 0.069118 0.071963 0.079350 0.072324 0.079340 0.035997 0.095855 0.079895 0.092806 0.091891 0.083985 0.088824 0.080956 0.088488 0.084554 0.086599 0.091114 0.122658 0.111600 0.103802 0.105428 0.109505 0.113629 0.085673 0.106539 0.087078 0.093865 0.088879
qa: -0.2934 -0.4872 0.0883 -0.1812 -0.1388 -0.1868 0.0642 -0.1135 -0.3170 -0.2964 -0.3022 -0.1387 -0.1535 0.0225 -0.2658 -0.1797 0.4727 0.0396 -0.2564 0.0393 0.0823 0.0691 0.0720 0.0794 0.0723 0.0793 0.0360 0.0959 0.0799 0.0928 0.0919 0.0840 0.0888 0.0810 0.0885 0.0846 0.0866 0.0911 0.1227 0.1116 0.1038 0.1054 0.1095 0.1136 0.0857 0.1065 0.0871 0.0939 0.0889
va: 2.1174 2.0126 3.7737 3.8756 3.8779 3.9083 3.7913 3.9092 3.9465 3.9291 3.9328 3.8819 3.9119 3.6959 3.9184 3.7733 4.1715 3.8528 3.9160 1.0234 1.0078 1.0105 1.0030 1.0111 1.0093 1.0109 1.0154 1.0054 1.0160 1.0021 1.0049 1.0020 1.0048 1.0039 1.0045 1.0029 1.0010 1.0055 1.0053 1.0236 0.9966 0.9956 1.0371 1.0332 1.0130 0.9954 1.0043 1.0071 1.0138
dispcorr: -0.019384930 hartree
energy: -816.448266152511
dipole: -21.49722 20.62276 -0.87446 22.87727 -22.52595 0.35132 -3.22041 3.76621 0.54580
magnitude: 1.08904 au
magnitude: 2.76812 debye
