program: Orca
programVersion: 5.0.2
elementType: O O C C C C C C C C C C C C C C C C C H H H H H H H H H H H H H H H H H H H H H H H H H H H H H H
charge: 0
multiplicity: 1
keywords: wb97x-d3
keywords: def2-TZVPP
keywords: def2/J RIJCOSX
keywords: DEFGRID2
keywords: scfconv7
keywords: smallprint printgap noloewdin
keywords: NOSOSCF
formula: C17H30O2
InChI: InChI=1/C17H30O2/c1-6-19-17(18)13-16(5)12-8-11-15(4)10-7-9-14(2)3/h8,12-15H,6-7,9-11H2,1-5H3
49 atoms
O  3.917137 -1.074531 0.826344
O  3.434276 -1.93099 -1.176293
C  -4.087444 -0.333468 -0.116682
C  -3.365821 0.952253 -0.537305
C  -2.840131 1.818098 0.601843
C  -2.259065 3.153003 0.136873
C  -1.071911 3.078062 -0.826591
C  -3.187142 -1.286686 0.686115
C  -5.3766 -0.057383 0.648775
C  -0.632228 4.482057 -1.226001
C  0.098126 2.2996 -0.236265
C  -1.930841 -1.634406 -0.036334
C  -0.701382 -1.425939 0.446853
C  0.54735 -1.703923 -0.258214
C  0.452268 -2.301417 -1.625656
C  1.688441 -1.371222 0.38367
C  3.064153 -1.505641 -0.103286
C  5.319437 -1.134736 0.537736
C  6.057238 -0.578718 1.729749
H  -4.361008 -0.85392 -1.042293
H  -4.055959 1.547145 -1.146471
H  -2.540118 0.686166 -1.204808
H  -2.089534 1.269163 1.178307
H  -3.650282 2.034212 1.30447
H  -3.057169 3.736456 -0.336158
H  -1.952174 3.726924 1.019036
H  -1.394215 2.562266 -1.738281
H  -3.753115 -2.206042 0.875913
H  -2.954407 -0.859225 1.665349
H  -5.187983 0.40911 1.617534
H  -6.036474 0.606646 0.086642
H  -5.926921 -0.981363 0.837939
H  -0.279437 5.047579 -0.359506
H  -1.451559 5.047863 -1.674796
H  0.182465 4.45453 -1.952684
H  -0.163166 1.262581 -0.021228
H  0.946565 2.279115 -0.923535
H  0.442805 2.752523 0.697518
H  -2.059396 -2.063539 -1.026582
H  -0.601788 -0.991446 1.438049
H  1.417392 -2.515928 -2.067353
H  -0.083426 -1.623815 -2.293909
H  -0.121879 -3.22915 -1.594747
H  1.599216 -0.944216 1.376281
H  5.540369 -0.553269 -0.360328
H  5.614538 -2.169461 0.347352
H  5.792066 0.461951 1.919307
H  5.860571 -1.157356 2.632989
H  7.129598 -0.618497 1.537697
elementType: O C H
totalener: -816.42843726 hartree
nucrepener: 1461.29286164 hartree
electener: -2277.72129891 hartree
oneelecener: -4007.94983579 hartree
twoeener: 1730.22853688 hartree
cpcmener: -0.01687600 hartree
kineticenergy: 812.44221758 hartree
xcener: -82.314210104413 hartree
chargesum: -0.0000000
charge: -0.285638 -0.485386 0.071364 -0.165910 -0.148394 -0.196154 0.078187 -0.139394 -0.326598 -0.301755 -0.271435 -0.107591 -0.171749 0.014581 -0.263584 -0.180826 0.468624 0.040254 -0.251533 0.052493 0.087013 0.078881 0.070321 0.087667 0.074206 0.077095 0.034681 0.098009 0.081789 0.083277 0.094463 0.094380 0.081327 0.087274 0.090110 0.043039 0.092494 0.087729 0.127154 0.120063 0.108783 0.104909 0.104792 0.113720 0.092148 0.094006 0.087195 0.086668 0.087254
qa: -0.2856 -0.4854 0.0714 -0.1659 -0.1484 -0.1962 0.0782 -0.1394 -0.3266 -0.3018 -0.2714 -0.1076 -0.1717 0.0146 -0.2636 -0.1808 0.4686 0.0403 -0.2515 0.0525 0.0870 0.0789 0.0703 0.0877 0.0742 0.0771 0.0347 0.0980 0.0818 0.0833 0.0945 0.0944 0.0813 0.0873 0.0901 0.0430 0.0925 0.0877 0.1272 0.1201 0.1088 0.1049 0.1048 0.1137 0.0921 0.0940 0.0872 0.0867 0.0873
va: 2.1185 2.0210 3.8033 3.8667 3.8602 3.9197 3.7956 3.9186 3.9507 3.9352 3.9281 3.8487 3.8843 3.6513 3.9191 3.7522 4.1636 3.8503 3.9707 1.0136 1.0073 1.0080 1.0025 1.0107 1.0093 1.0107 1.0148 1.0064 1.0064 0.9985 1.0031 1.0039 1.0037 1.0048 1.0042 1.0106 1.0078 1.0057 1.0016 1.0200 1.0360 0.9960 0.9967 1.0339 0.9969 0.9959 1.0034 1.0036 1.0068
dispcorr: -0.021947159 hartree
energy: -816.450384420963
dipole: -16.17984 15.23380 -0.94604 16.16343 -15.90458 0.25885 0.98453 -0.36853 0.61600
magnitude: 1.15821 au
magnitude: 2.94395 debye
