program: Orca
programVersion: 5.0.2
elementType: O O C C C C C C C C C C C C C C C C C H H H H H H H H H H H H H H H H H H H H H H H H H H H H H H
charge: 0
multiplicity: 1
keywords: wb97x-d3
keywords: def2-TZVPP
keywords: def2/J RIJCOSX
keywords: DEFGRID2
keywords: scfconv7
keywords: smallprint printgap noloewdin
keywords: NOSOSCF
formula: C17H30O2
InChI: InChI=1/C17H30O2/c1-6-19-17(18)13-16(5)12-8-11-15(4)10-7-9-14(2)3/h8,12-15H,6-7,9-11H2,1-5H3
49 atoms
O  3.896949 -0.997244 1.019526
O  3.426793 -2.505717 -0.561252
C  -4.060607 -0.473672 -0.2532
C  -3.274006 0.600956 -1.010759
C  -2.685079 1.717771 -0.155618
C  -1.841713 2.683575 -0.980569
C  -1.207811 3.82919 -0.188935
C  -3.210195 -1.193738 0.807814
C  -5.331961 0.076384 0.38268
C  -0.193796 3.327548 0.833988
C  -0.553555 4.828805 -1.136258
C  -1.944958 -1.752532 0.253867
C  -0.722779 -1.397807 0.665199
C  0.535374 -1.900396 0.119346
C  0.454221 -2.913747 -0.977014
C  1.670655 -1.395059 0.649005
C  3.051512 -1.715708 0.27747
C  5.304651 -1.141003 0.792071
C  5.784653 -0.306478 -0.374123
H  -4.359399 -1.225251 -0.993328
H  -3.928686 1.037466 -1.772717
H  -2.460327 0.119506 -1.563925
H  -2.074056 1.285538 0.640918
H  -3.484817 2.274665 0.34329
H  -1.046751 2.124973 -1.490129
H  -2.467534 3.1061 -1.774797
H  -2.00745 4.350164 0.35212
H  -3.809575 -2.012721 1.221037
H  -2.991071 -0.520065 1.640567
H  -5.959278 0.57836 -0.356731
H  -5.928403 -0.722239 0.82861
H  -5.113658 0.797054 1.173341
H  0.275207 4.158127 1.365627
H  0.60349 2.756902 0.349219
H  -0.647077 2.681588 1.587383
H  0.252745 4.361111 -1.707559
H  -1.271695 5.23245 -1.853127
H  -0.122682 5.6728 -0.593685
H  -2.059209 -2.47732 -0.547767
H  -0.636978 -0.666711 1.464848
H  1.423729 -3.242749 -1.329526
H  -0.095818 -2.504546 -1.826798
H  -0.100689 -3.790995 -0.638806
H  1.572399 -0.659844 1.439875
H  5.565375 -2.192442 0.660033
H  5.768002 -0.800629 1.717462
H  5.362002 -0.636734 -1.322621
H  5.543007 0.747748 -0.234789
H  6.869781 -0.390487 -0.44901
elementType: O C H
totalener: -816.42850334 hartree
nucrepener: 1444.02376624 hartree
electener: -2260.45226959 hartree
oneelecener: -3973.42585632 hartree
twoeener: 1712.97358673 hartree
cpcmener: -0.01647288 hartree
kineticenergy: 812.44542855 hartree
xcener: -82.313033253327 hartree
chargesum: 0.0000000
charge: -0.293234 -0.487166 0.082192 -0.158983 -0.151002 -0.159004 0.081965 -0.148476 -0.331913 -0.307642 -0.296099 -0.114102 -0.166274 0.025080 -0.265104 -0.182666 0.471701 0.038779 -0.255231 0.054508 0.086927 0.077328 0.056221 0.076944 0.065722 0.070594 0.023579 0.099224 0.081359 0.093848 0.094963 0.083884 0.092546 0.082413 0.089835 0.081045 0.087062 0.088935 0.127191 0.111433 0.107701 0.104392 0.105746 0.112508 0.085786 0.106102 0.088544 0.087460 0.093381
qa: -0.2932 -0.4872 0.0822 -0.1590 -0.1510 -0.1590 0.0820 -0.1485 -0.3319 -0.3076 -0.2961 -0.1141 -0.1663 0.0251 -0.2651 -0.1827 0.4717 0.0388 -0.2552 0.0545 0.0869 0.0773 0.0562 0.0769 0.0657 0.0706 0.0236 0.0992 0.0814 0.0938 0.0950 0.0839 0.0925 0.0824 0.0898 0.0810 0.0871 0.0889 0.1272 0.1114 0.1077 0.1044 0.1057 0.1125 0.0858 0.1061 0.0885 0.0875 0.0934
va: 2.1175 2.0129 3.7949 3.8864 3.8698 3.8793 3.8108 3.9245 3.9514 3.9283 3.9300 3.8474 3.9078 3.6802 3.9181 3.7672 4.1739 3.8541 3.9160 1.0134 1.0086 1.0078 1.0059 1.0101 1.0132 1.0121 1.0186 1.0067 1.0046 1.0032 1.0037 0.9969 1.0054 1.0033 1.0011 1.0030 1.0049 1.0054 1.0013 1.0216 1.0369 0.9963 0.9962 1.0345 1.0129 0.9954 1.0137 1.0042 1.0072
dispcorr: -0.020585196 hartree
energy: -816.449088538081
dipole: -16.24590 15.28377 -0.96213 18.39171 -17.83796 0.55375 -3.44655 3.84639 0.39985
magnitude: 1.17992 au
magnitude: 2.99911 debye
