program: Orca
programVersion: 5.0.2
elementType: O O C C C C C C C C C C C C C C C C C H H H H H H H H H H H H H H H H H H H H H H H H H H H H H H
charge: 0
multiplicity: 1
keywords: wb97x-d3
keywords: def2-TZVPP
keywords: def2/J RIJCOSX
keywords: DEFGRID2
keywords: scfconv7
keywords: smallprint printgap noloewdin
keywords: NOSOSCF
formula: C17H30O2
InChI: InChI=1/C17H30O2/c1-6-19-17(18)13-16(5)12-8-11-15(4)10-7-9-14(2)3/h8,12-15H,6-7,9-11H2,1-5H3
49 atoms
O  4.015228 -0.74619 0.735762
O  3.510452 -2.330936 -0.757645
C  -4.037205 -0.530261 -0.088552
C  -3.366547 0.540128 -0.955986
C  -2.784567 1.732409 -0.204532
C  -2.083283 2.712923 -1.137888
C  -1.496336 3.948852 -0.452397
C  -3.077434 -1.148665 0.941401
C  -5.287453 -0.010352 0.611659
C  -0.402703 3.588882 0.548229
C  -0.961358 4.928535 -1.491046
C  -1.832873 -1.69016 0.326722
C  -0.60045 -1.278504 0.64324
C  0.639331 -1.770323 0.048089
C  0.527879 -2.82681 -1.003843
C  1.786909 -1.217164 0.497118
C  3.155673 -1.520071 0.070043
C  5.417627 -0.894615 0.482226
C  6.019561 -2.058285 1.237414
H  -4.347357 -1.334946 -0.76564
H  -4.097859 0.898547 -1.688615
H  -2.568039 0.072449 -1.542334
H  -2.077667 1.379091 0.550739
H  -3.574657 2.258415 0.341304
H  -1.281713 2.191509 -1.675857
H  -2.794787 3.040566 -1.904283
H  -2.306226 4.446808 0.095057
H  -3.605922 -1.964807 1.447176
H  -2.82655 -0.41778 1.714816
H  -5.805107 -0.81235 1.14195
H  -5.051876 0.76331 1.344973
H  -5.993105 0.417292 -0.103495
H  0.413385 3.04849 0.060392
H  -0.771401 2.961092 1.360776
H  0.024774 4.483827 1.005154
H  -0.147767 4.483046 -2.069622
H  -1.738048 5.231306 -2.19635
H  -0.571814 5.835378 -1.024015
H  -1.972632 -2.456211 -0.431412
H  -0.491457 -0.508257 1.402258
H  0.010618 -3.702223 -0.606585
H  1.486435 -3.147733 -1.392121
H  -0.072145 -2.461661 -1.839863
H  1.709926 -0.454262 1.263702
H  5.856627 0.043179 0.820901
H  5.605168 -0.977986 -0.589743
H  5.841819 -1.970564 2.309766
H  5.631983 -3.018648 0.899166
H  7.099145 -2.06362 1.080479
elementType: O C H
totalener: -816.42872359 hartree
nucrepener: 1434.56898407 hartree
electener: -2250.99770766 hartree
oneelecener: -3954.52627248 hartree
twoeener: 1703.52856482 hartree
cpcmener: -0.01643394 hartree
kineticenergy: 812.44593513 hartree
xcener: -82.313112726061 hartree
chargesum: -0.0000000
charge: -0.292722 -0.487018 0.084611 -0.161269 -0.148065 -0.158234 0.081853 -0.149834 -0.330973 -0.306478 -0.297875 -0.113234 -0.163450 0.020522 -0.264849 -0.180422 0.471253 0.037947 -0.255036 0.055159 0.085197 0.078484 0.055327 0.076930 0.065967 0.068773 0.024579 0.098409 0.081437 0.094367 0.083898 0.093894 0.082413 0.089602 0.091841 0.081168 0.087336 0.089012 0.127255 0.110778 0.104920 0.107497 0.105288 0.112334 0.106152 0.086065 0.087003 0.088419 0.093766
qa: -0.2927 -0.4870 0.0846 -0.1613 -0.1481 -0.1582 0.0819 -0.1498 -0.3310 -0.3065 -0.2979 -0.1132 -0.1634 0.0205 -0.2648 -0.1804 0.4713 0.0379 -0.2550 0.0552 0.0852 0.0785 0.0553 0.0769 0.0660 0.0688 0.0246 0.0984 0.0814 0.0944 0.0839 0.0939 0.0824 0.0896 0.0918 0.0812 0.0873 0.0890 0.1273 0.1108 0.1049 0.1075 0.1053 0.1123 0.1062 0.0861 0.0870 0.0884 0.0938
va: 2.1168 2.0135 3.7892 3.8910 3.8702 3.8806 3.8112 3.9258 3.9510 3.9278 3.9320 3.8484 3.9074 3.6893 3.9178 3.7673 4.1738 3.8555 3.9138 1.0131 1.0089 1.0075 1.0053 1.0093 1.0129 1.0126 1.0183 1.0064 1.0044 1.0037 0.9970 1.0033 1.0032 1.0009 1.0054 1.0029 1.0048 1.0053 1.0013 1.0222 0.9962 1.0369 0.9962 1.0346 0.9955 1.0122 1.0044 1.0141 1.0072
dispcorr: -0.020349680 hartree
energy: -816.449073273681
dipole: -17.28788 16.34556 -0.94232 15.50118 -15.05457 0.44662 -0.87899 1.41636 0.53737
magnitude: 1.17311 au
magnitude: 2.98181 debye
