program: Orca
programVersion: 5.0.2
elementType: O O C C C C C C C C C C C C C C C C C H H H H H H H H H H H H H H H H H H H H H H H H H H H H H H
charge: 0
multiplicity: 1
keywords: wb97x-d3
keywords: def2-TZVPP
keywords: def2/J RIJCOSX
keywords: DEFGRID2
keywords: scfconv7
keywords: smallprint printgap noloewdin
keywords: NOSOSCF
formula: C17H30O2
InChI: InChI=1/C17H30O2/c1-6-19-17(18)13-16(5)12-8-11-15(4)10-7-9-14(2)3/h8,12-15H,6-7,9-11H2,1-5H3
49 atoms
O  3.46353 -0.633471 0.944437
O  3.157703 -1.439981 -1.113459
C  -4.200902 -0.213558 0.213119
C  -3.303718 0.958294 0.637495
C  -2.36105 1.4738 -0.451377
C  -1.172987 2.232268 0.126655
C  -0.251731 2.895208 -0.89922
C  -3.528733 -1.571617 0.501871
C  -5.548987 -0.166011 0.922486
C  0.872111 3.642355 -0.190231
C  0.327565 1.896256 -1.895833
C  -2.222813 -1.751237 -0.191507
C  -1.032913 -1.67136 0.413739
C  0.257358 -1.704638 -0.269244
C  0.266292 -2.088033 -1.714792
C  1.333982 -1.322981 0.452288
C  2.711047 -1.16189 -0.02114
C  4.845806 -0.382232 0.661198
C  5.44268 0.31264 1.859075
H  -4.384075 -0.143475 -0.865893
H  -2.720648 0.654553 1.515096
H  -3.925718 1.791201 0.979899
H  -2.920556 2.120068 -1.136704
H  -2.001526 0.639973 -1.057185
H  -1.541473 3.002132 0.81441
H  -0.58175 1.541305 0.741583
H  -0.844479 3.627731 -1.461058
H  -4.211176 -2.369163 0.190551
H  -3.394788 -1.668633 1.583744
H  -5.42563 -0.201025 2.007912
H  -6.089029 0.751946 0.683663
H  -6.185308 -1.006136 0.636796
H  1.504274 2.952968 0.376056
H  0.483601 4.383689 0.511534
H  1.515195 4.167814 -0.899205
H  0.905481 1.119828 -1.386412
H  -0.445471 1.402165 -2.486014
H  0.999781 2.390881 -2.60027
H  -2.272974 -1.904301 -1.26581
H  -1.003659 -1.493473 1.485369
H  -0.220004 -1.313798 -2.313194
H  -0.303025 -3.005942 -1.866868
H  1.263274 -2.236767 -2.110504
H  1.174909 -1.05355 1.490524
H  4.937365 0.241334 -0.230921
H  5.359307 -1.326304 0.463162
H  4.959033 1.27114 2.050826
H  5.372198 -0.298266 2.759578
H  6.498952 0.506153 1.671183
elementType: O C H
totalener: -816.42606464 hartree
nucrepener: 1500.04451565 hartree
electener: -2316.47058029 hartree
oneelecener: -4085.51978349 hartree
twoeener: 1769.04920320 hartree
cpcmener: -0.01685150 hartree
kineticenergy: 812.44218668 hartree
xcener: -82.310935734266 hartree
chargesum: -0.0000000
charge: -0.287222 -0.488618 0.077735 -0.194874 -0.117420 -0.196085 0.101615 -0.131561 -0.310127 -0.299382 -0.299458 -0.081034 -0.196737 0.017244 -0.265236 -0.189416 0.481919 0.037777 -0.251523 0.048470 0.069644 0.083996 0.083078 0.065234 0.082991 0.058961 0.027548 0.088614 0.080970 0.087374 0.089040 0.088699 0.079264 0.087343 0.090050 0.052030 0.092394 0.100675 0.129431 0.116140 0.100958 0.112331 0.113180 0.112643 0.091150 0.098315 0.087589 0.087016 0.087275
qa: -0.2872 -0.4886 0.0777 -0.1949 -0.1174 -0.1961 0.1016 -0.1316 -0.3101 -0.2994 -0.2995 -0.0810 -0.1967 0.0172 -0.2652 -0.1894 0.4819 0.0378 -0.2515 0.0485 0.0696 0.0840 0.0831 0.0652 0.0830 0.0590 0.0275 0.0886 0.0810 0.0874 0.0890 0.0887 0.0793 0.0873 0.0901 0.0520 0.0924 0.1007 0.1294 0.1161 0.1010 0.1123 0.1132 0.1126 0.0912 0.0983 0.0876 0.0870 0.0873
va: 2.1134 2.0135 3.7475 3.8909 3.8286 3.8983 3.7907 3.9372 3.9478 3.9382 3.9347 3.8173 3.9081 3.6343 3.9056 3.7713 4.1279 3.8492 3.9712 1.0205 1.0100 1.0068 1.0121 1.0072 1.0120 1.0085 1.0185 1.0090 1.0118 0.9997 1.0037 1.0048 1.0038 1.0051 1.0052 1.0134 0.9991 1.0092 0.9991 1.0208 0.9957 0.9999 1.0352 1.0344 0.9978 0.9962 1.0028 1.0033 1.0069
dispcorr: -0.023380896 hartree
energy: -816.449445535569
dipole: -12.71779 11.70455 -1.01325 13.82259 -13.44393 0.37866 0.32150 0.24176 0.56326
magnitude: 1.21956 au
magnitude: 3.09986 debye
