program: Orca
programVersion: 5.0.2
elementType: O O C C C C C C C C C C C C C C C C C H H H H H H H H H H H H H H H H H H H H H H H H H H H H H H
charge: 0
multiplicity: 1
keywords: wb97x-d3
keywords: def2-TZVPP
keywords: def2/J RIJCOSX
keywords: DEFGRID2
keywords: scfconv7
keywords: smallprint printgap noloewdin
keywords: NOSOSCF
formula: C17H30O2
InChI: InChI=1/C17H30O2/c1-6-19-17(18)13-16(5)12-8-11-15(4)10-7-9-14(2)3/h8,12-15H,6-7,9-11H2,1-5H3
49 atoms
O  3.982484 -0.696517 0.712649
O  3.48845 -2.29743 -0.766899
C  -4.053137 -0.532009 -0.093843
C  -3.366025 0.533422 -0.954338
C  -2.773758 1.716765 -0.19645
C  -2.035766 2.678178 -1.121284
C  -1.423826 3.898608 -0.429862
C  -3.105113 -1.16364 0.939671
C  -5.30117 -0.000455 0.601263
C  -0.343455 3.510648 0.574703
C  -0.860528 4.867048 -1.464113
C  -1.857143 -1.703821 0.330654
C  -0.627176 -1.286228 0.648957
C  0.615596 -1.767542 0.051559
C  0.511295 -2.829181 -0.995875
C  1.758648 -1.198047 0.491735
C  3.128558 -1.485766 0.057803
C  5.38505 -0.830481 0.451933
C  6.004205 -1.981067 1.213171
H  -4.368157 -1.331373 -0.774923
H  -4.088812 0.902382 -1.690177
H  -2.5699 0.058046 -1.537685
H  -2.087815 1.352329 0.572724
H  -3.56256 2.260714 0.333329
H  -1.241841 2.135366 -1.649345
H  -2.729179 3.023498 -1.896523
H  -2.224256 4.414634 0.114794
H  -3.641522 -1.981569 1.433847
H  -2.858201 -0.439796 1.720898
H  -5.829696 -0.797592 1.128178
H  -5.060476 0.769789 1.336534
H  -5.999045 0.43552 -0.116492
H  0.460987 2.95055 0.089647
H  -0.730781 2.891098 1.384951
H  0.104399 4.394027 1.034582
H  -0.056878 4.402518 -2.04161
H  -1.627149 5.191389 -2.170823
H  -0.449381 5.76239 -0.993418
H  -1.992308 -2.469901 -0.428252
H  -0.523164 -0.514876 1.407537
H  -0.087073 -2.469401 -1.835463
H  -0.004462 -3.704541 -0.596689
H  1.472114 -3.148432 -1.379778
H  1.676573 -0.432907 1.255575
H  5.815271 0.115033 0.780256
H  5.567297 -0.92074 -0.620379
H  5.623907 -2.948327 0.886488
H  7.082605 -1.977025 1.048346
H  5.833364 -1.885358 2.285954
elementType: O C H
totalener: -816.42860201 hartree
nucrepener: 1438.23173100 hartree
electener: -2254.66033301 hartree
oneelecener: -3961.85400009 hartree
twoeener: 1707.19366708 hartree
cpcmener: -0.01643397 hartree
kineticenergy: 812.44587445 hartree
xcener: -82.313164364120 hartree
chargesum: -0.0000000
charge: -0.292888 -0.487026 0.083872 -0.160850 -0.148582 -0.158128 0.082346 -0.149558 -0.331187 -0.307553 -0.297359 -0.112513 -0.165446 0.023000 -0.264834 -0.181735 0.471536 0.038305 -0.255290 0.055190 0.085720 0.078050 0.055001 0.077222 0.065718 0.069187 0.024293 0.098311 0.081267 0.094342 0.084010 0.093893 0.082482 0.089928 0.092171 0.081183 0.087289 0.088775 0.127435 0.110948 0.105535 0.104752 0.107425 0.112314 0.106264 0.085954 0.088492 0.093719 0.087018
qa: -0.2929 -0.4870 0.0839 -0.1608 -0.1486 -0.1581 0.0823 -0.1496 -0.3312 -0.3076 -0.2974 -0.1125 -0.1654 0.0230 -0.2648 -0.1817 0.4715 0.0383 -0.2553 0.0552 0.0857 0.0781 0.0550 0.0772 0.0657 0.0692 0.0243 0.0983 0.0813 0.0943 0.0840 0.0939 0.0825 0.0899 0.0922 0.0812 0.0873 0.0888 0.1274 0.1109 0.1055 0.1048 0.1074 0.1123 0.1063 0.0860 0.0885 0.0937 0.0870
va: 2.1169 2.0134 3.7909 3.8897 3.8700 3.8801 3.8106 3.9262 3.9513 3.9281 3.9313 3.8472 3.9082 3.6836 3.9179 3.7671 4.1734 3.8550 3.9140 1.0131 1.0088 1.0077 1.0057 1.0096 1.0131 1.0125 1.0183 1.0066 1.0045 1.0037 0.9969 1.0032 1.0032 1.0009 1.0055 1.0029 1.0048 1.0055 1.0012 1.0219 0.9961 0.9963 1.0369 1.0346 0.9955 1.0123 1.0141 1.0072 1.0044
dispcorr: -0.020486333 hartree
energy: -816.449088346297
dipole: -16.98002 16.03500 -0.94502 15.27562 -14.82762 0.44800 -0.80657 1.33674 0.53017
magnitude: 1.17254 au
magnitude: 2.98036 debye
