program: Orca
programVersion: 5.0.2
elementType: O O C C C C C C C C C C C C C C C C C H H H H H H H H H H H H H H H H H H H H H H H H H H H H H H
charge: 0
multiplicity: 1
keywords: wb97x-d3
keywords: def2-TZVPP
keywords: def2/J RIJCOSX
keywords: DEFGRID2
keywords: scfconv7
keywords: smallprint printgap noloewdin
keywords: NOSOSCF
formula: C17H30O2
InChI: InChI=1/C17H30O2/c1-6-19-17(18)13-16(5)12-8-11-15(4)10-7-9-14(2)3/h8,12-15H,6-7,9-11H2,1-5H3
49 atoms
O  3.541579 -0.754852 0.974823
O  3.198731 -1.423305 -1.126216
C  -4.19747 -0.242485 0.232047
C  -3.333389 0.960809 0.635788
C  -2.418352 1.490933 -0.467913
C  -1.280983 2.341191 0.082861
C  -0.385818 3.000273 -0.968013
C  -3.483998 -1.577287 0.528192
C  -5.540633 -0.225887 0.952252
C  0.679954 3.854318 -0.290586
C  0.266355 1.980594 -1.896258
C  -2.18114 -1.733375 -0.177017
C  -0.986716 -1.649468 0.419082
C  0.299608 -1.676917 -0.272226
C  0.297327 -2.027057 -1.726287
C  1.385435 -1.330992 0.453815
C  2.766419 -1.195187 -0.016596
C  4.932175 -0.541798 0.702565
C  5.56504 0.017845 1.951891
H  -4.391751 -0.189066 -0.846015
H  -2.733181 0.686461 1.51175
H  -3.978009 1.778742 0.97267
H  -3.0127 2.075945 -1.178448
H  -2.008094 0.657134 -1.040761
H  -1.698665 3.122437 0.728448
H  -0.658973 1.715376 0.735546
H  -1.012441 3.662079 -1.578694
H  -4.147644 -2.396404 0.231944
H  -3.33674 -1.660398 1.6095
H  -5.407592 -0.245992 2.03696
H  -6.108012 0.674141 0.708656
H  -6.155496 -1.086458 0.680685
H  0.236545 4.608946 0.362814
H  1.30048 4.377174 -1.021283
H  1.344301 3.238996 0.322056
H  -0.467009 1.415728 -2.473343
H  0.928914 2.470027 -2.613391
H  0.870141 1.26301 -1.33272
H  -2.23885 -1.87886 -1.252026
H  -0.950208 -1.482396 1.492218
H  -0.187536 -1.235979 -2.303561
H  -0.278773 -2.937527 -1.896375
H  1.290906 -2.172922 -2.131563
H  1.235684 -1.090468 1.50042
H  5.045829 0.153375 -0.132395
H  5.403007 -1.485931 0.418205
H  5.479085 -0.670607 2.793337
H  6.626377 0.188135 1.770281
H  5.119584 0.971692 2.236311
elementType: O C H
totalener: -816.42662620 hartree
nucrepener: 1489.48348614 hartree
electener: -2305.91011234 hartree
oneelecener: -4064.40765147 hartree
twoeener: 1758.49753913 hartree
cpcmener: -0.01691118 hartree
kineticenergy: 812.43964240 hartree
xcener: -82.310106439662 hartree
chargesum: 0.0000000
charge: -0.286519 -0.488494 0.078760 -0.193069 -0.119133 -0.186994 0.100183 -0.132337 -0.309666 -0.298385 -0.305293 -0.081489 -0.191783 0.007537 -0.263245 -0.179871 0.477028 0.039797 -0.251664 0.047818 0.069361 0.083460 0.081038 0.063620 0.080484 0.058332 0.025455 0.089156 0.080731 0.087495 0.089055 0.088629 0.087508 0.089898 0.080167 0.091714 0.099645 0.060987 0.129578 0.114635 0.101192 0.111008 0.112557 0.112322 0.091531 0.095560 0.087132 0.087205 0.087360
qa: -0.2865 -0.4885 0.0788 -0.1931 -0.1191 -0.1870 0.1002 -0.1323 -0.3097 -0.2984 -0.3053 -0.0815 -0.1918 0.0075 -0.2632 -0.1799 0.4770 0.0398 -0.2517 0.0478 0.0694 0.0835 0.0810 0.0636 0.0805 0.0583 0.0255 0.0892 0.0807 0.0875 0.0891 0.0886 0.0875 0.0899 0.0802 0.0917 0.0996 0.0610 0.1296 0.1146 0.1012 0.1110 0.1126 0.1123 0.0915 0.0956 0.0871 0.0872 0.0874
va: 2.1179 2.0135 3.7455 3.8933 3.8352 3.8920 3.7961 3.9385 3.9472 3.9367 3.9380 3.8236 3.9039 3.6476 3.9076 3.7641 4.1417 3.8505 3.9697 1.0206 1.0098 1.0069 1.0129 1.0081 1.0119 1.0105 1.0187 1.0085 1.0119 0.9998 1.0037 1.0048 1.0050 1.0054 1.0026 0.9984 1.0088 1.0093 0.9989 1.0218 0.9958 0.9996 1.0351 1.0342 0.9971 0.9959 1.0033 1.0069 1.0033
dispcorr: -0.022821337 hartree
energy: -816.449447535839
dipole: -13.18175 12.17651 -1.00524 13.89683 -13.58918 0.30765 0.33032 0.25805 0.58837
magnitude: 1.20471 au
magnitude: 3.06213 debye
