program: Orca
programVersion: 5.0.2
elementType: O O C C C C C C C C C C C C C C C C C H H H H H H H H H H H H H H H H H H H H H H H H H H H H H H
charge: 0
multiplicity: 1
keywords: wb97x-d3
keywords: def2-TZVPP
keywords: def2/J RIJCOSX
keywords: DEFGRID2
keywords: scfconv7
keywords: smallprint printgap noloewdin
keywords: NOSOSCF
formula: C17H30O2
InChI: InChI=1/C17H30O2/c1-6-19-17(18)13-16(5)12-8-11-15(4)10-7-9-14(2)3/h8,12-15H,6-7,9-11H2,1-5H3
49 atoms
O  4.669496 -2.212508 0.823792
O  3.755997 -3.625695 -0.640549
C  -2.691853 0.477814 0.010011
C  -3.677962 1.403873 0.72587
C  -4.123243 2.641337 -0.05134
C  -2.976132 3.557401 -0.463861
C  -3.407403 4.855516 -1.151495
C  -2.259475 -0.640892 0.974835
C  -3.272056 -0.079587 -1.283193
C  -4.16278 5.787379 -0.209989
C  -2.196982 5.571461 -1.740848
C  -1.218587 -1.544901 0.403141
C  0.079847 -1.46951 0.715013
C  1.139065 -2.300541 0.147182
C  0.740017 -3.342681 -0.848383
C  2.396615 -2.053034 0.573711
C  3.631659 -2.729377 0.165922
C  5.971548 -2.750773 0.560914
C  6.957391 -2.017095 1.435206
H  -1.789323 1.047803 -0.236531
H  -3.226275 1.730696 1.669113
H  -4.564828 0.822684 1.00344
H  -4.828874 3.18939 0.57924
H  -4.68973 2.34753 -0.940909
H  -2.370698 3.804158 0.417632
H  -2.309282 3.015509 -1.142234
H  -4.077606 4.591179 -1.978973
H  -3.141645 -1.230009 1.24933
H  -1.883328 -0.183667 1.894087
H  -4.172006 -0.670012 -1.09002
H  -3.544758 0.715424 -1.978681
H  -2.562103 -0.722727 -1.806005
H  -3.541552 6.069901 0.644321
H  -5.074917 5.335419 0.182344
H  -4.45604 6.707943 -0.719039
H  -1.484494 5.850255 -0.959847
H  -1.667697 4.94032 -2.457698
H  -2.485721 6.487103 -2.260984
H  -1.556108 -2.278821 -0.321637
H  0.395762 -0.727583 1.443979
H  1.575848 -3.922023 -1.220008
H  0.242423 -2.877575 -1.701678
H  0.019207 -4.03187 -0.404182
H  2.532845 -1.265226 1.306195
H  6.219929 -2.62307 -0.495412
H  5.982357 -3.820956 0.780097
H  6.976898 -0.949245 1.214913
H  6.734909 -2.149515 2.494539
H  7.957654 -2.411395 1.254774
elementType: O C H
totalener: -816.42883102 hartree
nucrepener: 1363.21552269 hartree
electener: -2179.64435370 hartree
oneelecener: -3811.63658020 hartree
twoeener: 1631.99222650 hartree
cpcmener: -0.01695427 hartree
kineticenergy: 812.43929207 hartree
xcener: -82.309896577264 hartree
chargesum: 0.0000000
charge: -0.285528 -0.485472 0.102650 -0.210298 -0.140529 -0.156226 0.064253 -0.136886 -0.328913 -0.297943 -0.289550 -0.126611 -0.148491 0.008603 -0.262587 -0.162979 0.456301 0.039985 -0.251219 0.050337 0.077946 0.081417 0.082849 0.070155 0.069730 0.071121 0.025231 0.093069 0.081317 0.088145 0.093608 0.094045 0.081147 0.088076 0.090216 0.080533 0.086206 0.089421 0.128553 0.110500 0.108882 0.103182 0.104519 0.113413 0.093838 0.092738 0.086836 0.087023 0.087389
qa: -0.2855 -0.4855 0.1026 -0.2103 -0.1405 -0.1562 0.0643 -0.1369 -0.3289 -0.2979 -0.2895 -0.1266 -0.1485 0.0086 -0.2626 -0.1630 0.4563 0.0400 -0.2512 0.0503 0.0779 0.0814 0.0828 0.0702 0.0697 0.0711 0.0252 0.0931 0.0813 0.0881 0.0936 0.0940 0.0811 0.0881 0.0902 0.0805 0.0862 0.0894 0.1286 0.1105 0.1089 0.1032 0.1045 0.1134 0.0938 0.0927 0.0868 0.0870 0.0874
va: 2.1188 2.0208 3.7370 3.9439 3.8764 3.8646 3.8300 3.9381 3.9606 3.9301 3.9235 3.8777 3.9157 3.7049 3.9223 3.7757 4.1708 3.8504 3.9698 1.0210 1.0079 1.0094 1.0134 1.0042 1.0116 1.0103 1.0178 1.0077 1.0169 1.0011 1.0007 1.0024 1.0032 1.0045 1.0042 1.0032 1.0055 1.0053 0.9947 1.0234 1.0367 0.9967 0.9961 1.0326 0.9961 0.9966 1.0035 1.0035 1.0068
dispcorr: -0.018682964 hartree
energy: -816.447513980431
dipole: -23.22381 22.50830 -0.71551 25.25448 -24.45790 0.79658 -3.23686 3.71815 0.48129
magnitude: 1.17394 au
magnitude: 2.98392 debye
