program: Orca
programVersion: 5.0.2
elementType: O O C C C C C C C C C C C C C C C C C H H H H H H H H H H H H H H H H H H H H H H H H H H H H H H
charge: 0
multiplicity: 1
keywords: wb97x-d3
keywords: def2-TZVPP
keywords: def2/J RIJCOSX
keywords: DEFGRID2
keywords: scfconv7
keywords: smallprint printgap noloewdin
keywords: NOSOSCF
formula: C17H30O2
InChI: InChI=1/C17H30O2/c1-6-19-17(18)13-16(5)12-8-11-15(4)10-7-9-14(2)3/h8,12-15H,6-7,9-11H2,1-5H3
49 atoms
O  4.551011 -2.100401 0.697541
O  3.902458 -4.121472 0.012309
C  -1.393108 1.25553 0.077131
C  -2.712598 2.017346 0.219718
C  -2.59371 3.527646 0.04703
C  -3.871771 4.288823 0.391564
C  -5.101947 3.960348 -0.45848
C  -1.607843 -0.221889 0.445804
C  -0.803088 1.386498 -1.322183
C  -6.302156 4.766424 0.026856
C  -4.857047 4.212766 -1.941475
C  -0.340236 -1.004324 0.501211
C  -0.058908 -2.048286 -0.282483
C  1.171463 -2.8507 -0.253223
C  0.969767 -4.256829 -0.723765
C  2.335601 -2.298749 0.142734
C  3.635212 -2.965183 0.25902
C  5.896335 -2.567805 0.857142
C  6.73436 -1.405676 1.328063
H  -0.67878 1.679498 0.794366
H  -3.129728 1.812398 1.212413
H  -3.432223 1.610032 -0.499473
H  -2.281926 3.770988 -0.972151
H  -1.791789 3.894287 0.6967
H  -4.115292 4.107949 1.444633
H  -3.673511 5.363944 0.310311
H  -5.342855 2.898806 -0.330366
H  -2.302941 -0.679037 -0.265504
H  -2.087134 -0.264503 1.430158
H  -1.488961 0.985622 -2.073786
H  -0.598887 2.425326 -1.583697
H  0.138906 0.843839 -1.416941
H  -7.205111 4.519585 -0.535494
H  -6.128592 5.839846 -0.08683
H  -6.512726 4.578667 1.082001
H  -5.757349 4.019035 -2.528342
H  -4.566914 5.251879 -2.120292
H  -4.06783 3.577533 -2.347239
H  0.382902 -0.683135 1.247288
H  -0.816899 -2.386943 -0.984656
H  0.169036 -4.728536 -0.149832
H  1.853792 -4.879148 -0.661897
H  0.630651 -4.242331 -1.762981
H  2.342605 -1.246585 0.401361
H  6.270646 -2.95398 -0.093865
H  5.923425 -3.384391 1.582693
H  7.765568 -1.736135 1.454037
H  6.733608 -0.588904 0.605424
H  6.389607 -1.020471 2.288232
elementType: O C H
totalener: -816.42656640 hartree
nucrepener: 1364.14935558 hartree
electener: -2180.57592198 hartree
oneelecener: -3813.54071649 hartree
twoeener: 1632.96479451 hartree
cpcmener: -0.01700035 hartree
kineticenergy: 812.43548891 hartree
xcener: -82.307783400129 hartree
chargesum: -0.0000000
charge: -0.288513 -0.486839 0.108136 -0.186066 -0.129812 -0.192036 0.065933 -0.098943 -0.336384 -0.296857 -0.302607 -0.159976 -0.138831 0.041957 -0.247348 -0.221440 0.473816 0.042324 -0.251168 0.042885 0.075310 0.070333 0.070500 0.079454 0.073104 0.079028 0.034936 0.079025 0.092247 0.084039 0.097993 0.097073 0.089011 0.080654 0.088076 0.091159 0.084994 0.086361 0.118231 0.115253 0.106717 0.104202 0.105105 0.113354 0.092066 0.092443 0.087338 0.086783 0.086984
qa: -0.2885 -0.4868 0.1081 -0.1861 -0.1298 -0.1920 0.0659 -0.0989 -0.3364 -0.2969 -0.3026 -0.1600 -0.1388 0.0420 -0.2473 -0.2214 0.4738 0.0423 -0.2512 0.0429 0.0753 0.0703 0.0705 0.0795 0.0731 0.0790 0.0349 0.0790 0.0922 0.0840 0.0980 0.0971 0.0890 0.0807 0.0881 0.0912 0.0850 0.0864 0.1182 0.1153 0.1067 0.1042 0.1051 0.1134 0.0921 0.0924 0.0873 0.0868 0.0870
va: 2.1162 2.0183 3.7583 3.8953 3.8702 3.9117 3.7886 3.9163 3.9529 3.9292 3.9335 3.9072 3.8800 3.7256 3.9212 3.8101 4.1630 3.8504 3.9693 1.0225 1.0118 1.0081 1.0032 1.0111 1.0092 1.0104 1.0156 1.0160 1.0076 1.0036 1.0030 1.0018 1.0050 1.0041 1.0045 1.0056 1.0027 1.0010 1.0119 1.0140 0.9989 1.0337 0.9969 1.0319 0.9969 0.9961 1.0069 1.0035 1.0033
dispcorr: -0.018938454 hartree
energy: -816.445504854159
dipole: -25.64091 24.98478 -0.65612 26.67747 -25.58032 1.09715 -3.53300 3.78522 0.25221
magnitude: 1.30301 au
magnitude: 3.31199 debye
