program: Orca
programVersion: 5.0.2
elementType: O O C C C C C C C C C C C C C C C C C H H H H H H H H H H H H H H H H H H H H H H H H H H H H H H
charge: 0
multiplicity: 1
keywords: wb97x-d3
keywords: def2-TZVPP
keywords: def2/J RIJCOSX
keywords: DEFGRID2
keywords: scfconv7
keywords: smallprint printgap noloewdin
keywords: NOSOSCF
formula: C17H30O2
InChI: InChI=1/C17H30O2/c1-6-19-17(18)13-16(5)12-8-11-15(4)10-7-9-14(2)3/h8,12-15H,6-7,9-11H2,1-5H3
49 atoms
O  3.607877 -1.965438 -0.855708
O  3.80157 -1.980114 1.366226
C  -3.070997 -0.534814 -1.371605
C  -2.308431 0.792834 -1.427805
C  -2.606052 1.774884 -0.299982
C  -1.742039 3.027596 -0.385802
C  -1.917296 4.012587 0.771368
C  -2.764823 -1.341037 -0.098192
C  -4.576454 -0.348277 -1.519617
C  -0.895481 5.138864 0.665896
C  -3.329735 4.583468 0.838401
C  -1.309608 -1.603955 0.088877
C  -0.594476 -1.178256 1.133383
C  0.837059 -1.414684 1.361045
C  1.210062 -1.416939 2.810231
C  1.674737 -1.575193 0.31723
C  3.111371 -1.856366 0.377373
C  5.010165 -2.225958 -0.994745
C  5.316306 -2.325685 -2.467964
H  -2.727241 -1.132044 -2.224436
H  -2.525641 1.275673 -2.386785
H  -1.233257 0.583892 -1.440929
H  -2.434011 1.296306 0.669946
H  -3.664304 2.04881 -0.320627
H  -0.690417 2.721892 -0.426605
H  -1.940779 3.547961 -1.330943
H  -1.725888 3.469488 1.705246
H  -3.290907 -2.299346 -0.170374
H  -3.169923 -0.830267 0.779457
H  -5.007768 0.182976 -0.668882
H  -4.819773 0.219304 -2.420201
H  -5.086918 -1.310722 -1.592236
H  -1.042315 5.718579 -0.249277
H  0.126318 4.753683 0.650099
H  -0.971419 5.831253 1.506933
H  -3.586726 5.104007 -0.088254
H  -4.083764 3.812273 1.002093
H  -3.425204 5.302764 1.654509
H  -0.825801 -2.185552 -0.692633
H  -1.109249 -0.644073 1.928601
H  2.251737 -1.639368 3.003844
H  0.591952 -2.136956 3.351048
H  0.981928 -0.437793 3.239442
H  1.270685 -1.48469 -0.684101
H  5.269404 -3.155422 -0.482461
H  5.584658 -1.418864 -0.533776
H  4.768342 -3.141942 -2.93988
H  5.081695 -1.399599 -2.993904
H  6.38078 -2.520854 -2.599618
elementType: O C H
totalener: -816.42612562 hartree
nucrepener: 1422.23800474 hartree
electener: -2238.66413037 hartree
oneelecener: -3929.79542969 hartree
twoeener: 1691.13129932 hartree
cpcmener: -0.01705344 hartree
kineticenergy: 812.44280273 hartree
xcener: -82.309982781373 hartree
chargesum: 0.0000000
charge: -0.289008 -0.487675 0.083773 -0.157681 -0.166908 -0.159801 0.075708 -0.143384 -0.332624 -0.296388 -0.303120 -0.117482 -0.163998 0.042017 -0.250687 -0.215921 0.473271 0.041161 -0.251578 0.056388 0.086316 0.076593 0.065495 0.085345 0.069433 0.067793 0.027186 0.097890 0.082195 0.082519 0.094837 0.095523 0.079945 0.087623 0.089201 0.082105 0.088512 0.090922 0.121712 0.115932 0.104301 0.107499 0.105627 0.112613 0.091577 0.094009 0.086795 0.087107 0.087331
qa: -0.2890 -0.4877 0.0838 -0.1577 -0.1669 -0.1598 0.0757 -0.1434 -0.3326 -0.2964 -0.3031 -0.1175 -0.1640 0.0420 -0.2507 -0.2159 0.4733 0.0412 -0.2516 0.0564 0.0863 0.0766 0.0655 0.0853 0.0694 0.0678 0.0272 0.0979 0.0822 0.0825 0.0948 0.0955 0.0799 0.0876 0.0892 0.0821 0.0885 0.0909 0.1217 0.1159 0.1043 0.1075 0.1056 0.1126 0.0916 0.0940 0.0868 0.0871 0.0873
va: 2.1161 2.0172 3.7899 3.9003 3.8687 3.8791 3.8125 3.9219 3.9537 3.9323 3.9286 3.8536 3.8700 3.7350 3.9212 3.8024 4.1636 3.8501 3.9699 1.0131 1.0083 1.0067 1.0070 1.0010 1.0131 1.0124 1.0181 1.0063 1.0042 0.9969 1.0030 1.0045 1.0034 1.0049 1.0052 1.0029 1.0022 1.0046 1.0084 1.0111 1.0339 0.9988 0.9967 1.0335 0.9968 0.9961 1.0034 1.0034 1.0069
dispcorr: -0.019680493 hartree
energy: -816.445806115123
dipole: -19.82933 18.79712 -1.03220 18.90087 -18.82482 0.07605 -4.55366 3.78031 -0.77335
magnitude: 1.29201 au
magnitude: 3.28403 debye
