program: Orca
programVersion: 5.0.2
elementType: O O C C C C C C C C C C C C C C C C C H H H H H H H H H H H H H H H H H H H H H H H H H H H H H H
charge: 0
multiplicity: 1
keywords: wb97x-d3
keywords: def2-TZVPP
keywords: def2/J RIJCOSX
keywords: DEFGRID2
keywords: scfconv7
keywords: smallprint printgap noloewdin
keywords: NOSOSCF
formula: C17H30O2
InChI: InChI=1/C17H30O2/c1-6-19-17(18)13-16(5)12-8-11-15(4)10-7-9-14(2)3/h8,12-15H,6-7,9-11H2,1-5H3
49 atoms
O  3.663454 -0.949988 1.00055
O  3.256367 -1.337553 -1.158345
C  -4.201059 -0.289657 0.248315
C  -3.413144 0.977733 0.60646
C  -2.510559 1.510013 -0.504794
C  -1.492002 2.51744 0.011264
C  -0.603672 3.151708 -1.059857
C  -3.408658 -1.568506 0.583919
C  -5.541295 -0.326753 0.973425
C  0.293985 4.217486 -0.440734
C  0.236894 2.11508 -1.797946
C  -2.112185 -1.683611 -0.139953
C  -0.909777 -1.596093 0.439387
C  0.366203 -1.609816 -0.271356
C  0.336825 -1.895149 -1.739137
C  1.470411 -1.332795 0.456362
C  2.851503 -1.222477 -0.021282
C  5.062201 -0.798327 0.72896
C  5.748149 -0.458032 2.028149
H  -4.400913 -0.284626 -0.830133
H  -2.814715 0.780447 1.504151
H  -4.110289 1.771809 0.892484
H  -3.13058 1.972207 -1.280812
H  -1.991679 0.681829 -0.990377
H  -2.018851 3.313084 0.550581
H  -0.851432 2.024668 0.753739
H  -1.255867 3.642964 -1.792487
H  -4.030346 -2.433896 0.329598
H  -3.240103 -1.604191 1.664712
H  -6.106146 -1.230146 0.734099
H  -5.404255 -0.302117 2.057563
H  -6.160501 0.530253 0.702399
H  0.971104 3.780204 0.297879
H  -0.288425 4.989998 0.06602
H  0.909376 4.71243 -1.194795
H  0.898083 2.590225 -2.525771
H  0.866729 1.551884 -1.103086
H  -0.375925 1.397118 -2.344924
H  -2.183924 -1.813659 -1.216193
H  -0.857314 -1.45165 1.515121
H  1.322835 -1.999223 -2.174613
H  -0.182819 -1.09367 -2.269551
H  -0.220941 -2.812494 -1.934542
H  1.34078 -1.150293 1.517279
H  5.215514 -0.006593 -0.008087
H  5.460804 -1.725805 0.310944
H  5.621346 -1.245606 2.771742
H  6.816998 -0.340849 1.848675
H  5.377443 0.478189 2.446891
elementType: O C H
totalener: -816.42729634 hartree
nucrepener: 1475.34324299 hartree
electener: -2291.77053933 hartree
oneelecener: -4036.13576960 hartree
twoeener: 1744.36523027 hartree
cpcmener: -0.01710758 hartree
kineticenergy: 812.44401560 hartree
xcener: -82.310813430070 hartree
chargesum: 0.0000000
charge: -0.285801 -0.487956 0.080254 -0.189625 -0.121164 -0.173936 0.095527 -0.132296 -0.308529 -0.296821 -0.316372 -0.084736 -0.184125 0.002448 -0.262916 -0.172357 0.471576 0.040909 -0.251192 0.046336 0.068684 0.082265 0.077959 0.057777 0.075745 0.062112 0.026294 0.090225 0.079963 0.088519 0.087463 0.088909 0.081049 0.087446 0.089537 0.098445 0.073160 0.091367 0.129383 0.112547 0.111611 0.100761 0.110970 0.112161 0.092046 0.093496 0.086901 0.086906 0.087073
qa: -0.2858 -0.4880 0.0803 -0.1896 -0.1212 -0.1739 0.0955 -0.1323 -0.3085 -0.2968 -0.3164 -0.0847 -0.1841 0.0024 -0.2629 -0.1724 0.4716 0.0409 -0.2512 0.0463 0.0687 0.0823 0.0780 0.0578 0.0757 0.0621 0.0263 0.0902 0.0800 0.0885 0.0875 0.0889 0.0810 0.0874 0.0895 0.0984 0.0732 0.0914 0.1294 0.1125 0.1116 0.1008 0.1110 0.1122 0.0920 0.0935 0.0869 0.0869 0.0871
va: 2.1198 2.0135 3.7447 3.8985 3.8458 3.8849 3.8011 3.9397 3.9453 3.9340 3.9428 3.8366 3.9000 3.6655 3.9094 3.7611 4.1529 3.8499 3.9695 1.0211 1.0097 1.0067 1.0142 1.0127 1.0116 1.0123 1.0185 1.0077 1.0126 1.0048 0.9998 1.0039 1.0023 1.0050 1.0056 1.0080 1.0040 0.9971 0.9991 1.0231 1.0355 0.9961 0.9988 1.0336 0.9969 0.9960 1.0034 1.0071 1.0034
dispcorr: -0.022184669 hartree
energy: -816.449481008392
dipole: -13.99210 13.00322 -0.98888 13.90963 -13.75393 0.15571 0.38435 0.23444 0.61880
magnitude: 1.17688 au
magnitude: 2.99139 debye
