program: Orca
programVersion: 5.0.2
elementType: O O C C C C C C C C C C C C C C C C C H H H H H H H H H H H H H H H H H H H H H H H H H H H H H H
charge: 0
multiplicity: 1
keywords: wb97x-d3
keywords: def2-TZVPP
keywords: def2/J RIJCOSX
keywords: DEFGRID2
keywords: scfconv7
keywords: smallprint printgap noloewdin
keywords: NOSOSCF
formula: C17H30O2
InChI: InChI=1/C17H30O2/c1-6-19-17(18)13-16(5)12-8-11-15(4)10-7-9-14(2)3/h8,12-15H,6-7,9-11H2,1-5H3
49 atoms
O  3.568765 -0.7869 0.973024
O  3.199987 -1.381096 -1.145068
C  -4.204476 -0.254391 0.232348
C  -3.35576 0.961651 0.629982
C  -2.442113 1.493226 -0.47399
C  -1.323661 2.370134 0.073734
C  -0.427376 3.022975 -0.979782
C  -3.474501 -1.577918 0.538316
C  -5.549475 -0.249745 0.94922
C  0.601809 3.926589 -0.309455
C  0.270134 1.99514 -1.86493
C  -2.171167 -1.721679 -0.168377
C  -0.975693 -1.627214 0.424096
C  0.307816 -1.647244 -0.272863
C  0.298333 -1.995055 -1.727278
C  1.398299 -1.308097 0.449568
C  2.778424 -1.179443 -0.02631
C  4.962317 -0.596857 0.698433
C  5.615978 -0.093382 1.960931
H  -4.397324 -0.210293 -0.846454
H  -2.755747 0.701596 1.51045
H  -4.011626 1.774443 0.95761
H  -3.041875 2.059449 -1.195143
H  -2.013945 0.659809 -1.034034
H  -1.760209 3.156238 0.700736
H  -0.698688 1.765604 0.743616
H  -1.060764 3.648398 -1.621055
H  -4.128079 -2.407079 0.247489
H  -3.325592 -1.652341 1.620008
H  -6.153718 -1.118596 0.680128
H  -5.418698 -0.263202 2.034272
H  -6.126608 0.642535 0.69994
H  0.12514 4.689358 0.310143
H  1.223208 4.442237 -1.044479
H  1.269657 3.350338 0.336589
H  0.930445 2.481332 -2.586382
H  0.88424 1.312833 -1.269765
H  -0.437213 1.391906 -2.435687
H  -2.230073 -1.868806 -1.243033
H  -0.936322 -1.459761 1.49707
H  -0.256955 -2.919809 -1.891205
H  1.2904 -2.116449 -2.143654
H  -0.212967 -1.216365 -2.298189
H  1.254944 -1.074406 1.498615
H  5.087364 0.122102 -0.114465
H  5.408868 -1.542181 0.380681
H  5.197726 0.862764 2.277121
H  5.515852 -0.80513 2.781048
H  6.680601 0.054202 1.778343
elementType: O C H
totalener: -816.42675295 hartree
nucrepener: 1487.50066891 hartree
electener: -2303.92742187 hartree
oneelecener: -4060.45115420 hartree
twoeener: 1756.52373234 hartree
cpcmener: -0.01694474 hartree
kineticenergy: 812.44043177 hartree
xcener: -82.310446544577 hartree
chargesum: -0.0000000
charge: -0.286372 -0.488542 0.078924 -0.192900 -0.119445 -0.185499 0.101533 -0.132535 -0.309610 -0.298509 -0.307753 -0.080891 -0.191913 0.006476 -0.262641 -0.179447 0.477456 0.040197 -0.250971 0.047741 0.069263 0.083304 0.080653 0.062761 0.079960 0.058751 0.024542 0.089329 0.080713 0.088693 0.087440 0.089011 0.087328 0.089814 0.081042 0.099716 0.062934 0.091563 0.129572 0.114394 0.111685 0.112406 0.099997 0.112309 0.091619 0.094845 0.086965 0.087059 0.087030
qa: -0.2864 -0.4885 0.0789 -0.1929 -0.1194 -0.1855 0.1015 -0.1325 -0.3096 -0.2985 -0.3078 -0.0809 -0.1919 0.0065 -0.2626 -0.1794 0.4775 0.0402 -0.2510 0.0477 0.0693 0.0833 0.0807 0.0628 0.0800 0.0588 0.0245 0.0893 0.0807 0.0887 0.0874 0.0890 0.0873 0.0898 0.0810 0.0997 0.0629 0.0916 0.1296 0.1144 0.1117 0.1124 0.1000 0.1123 0.0916 0.0948 0.0870 0.0871 0.0870
va: 2.1192 2.0129 3.7451 3.8946 3.8361 3.8913 3.7961 3.9390 3.9469 3.9356 3.9391 3.8247 3.9037 3.6481 3.9074 3.7618 4.1422 3.8503 3.9694 1.0207 1.0097 1.0069 1.0131 1.0089 1.0117 1.0110 1.0189 1.0084 1.0121 1.0048 0.9998 1.0037 1.0051 1.0054 1.0022 1.0087 1.0086 0.9981 0.9988 1.0220 0.9993 1.0356 0.9962 1.0340 0.9972 0.9957 1.0034 1.0034 1.0069
dispcorr: -0.022758995 hartree
energy: -816.449511946884
dipole: -13.30653 12.30826 -0.99826 13.73223 -13.47413 0.25810 0.39347 0.20571 0.59918
magnitude: 1.19254 au
magnitude: 3.03121 debye
