program: Orca
programVersion: 5.0.2
elementType: O O C C C C C C C C C C C C C C C C C H H H H H H H H H H H H H H H H H H H H H H H H H H H H H H
charge: 0
multiplicity: 1
keywords: wb97x-d3
keywords: def2-TZVPP
keywords: def2/J RIJCOSX
keywords: DEFGRID2
keywords: scfconv7
keywords: smallprint printgap noloewdin
keywords: NOSOSCF
formula: C17H30O2
InChI: InChI=1/C17H30O2/c1-6-19-17(18)13-16(5)12-8-11-15(4)10-7-9-14(2)3/h8,12-15H,6-7,9-11H2,1-5H3
49 atoms
O  4.408448 -3.402746 0.152385
O  4.690939 -1.283661 0.786251
C  -2.825477 -0.069971 -0.555709
C  -2.821789 1.445329 -0.341038
C  -3.263555 2.250298 -1.559095
C  -3.050444 3.754737 -1.409001
C  -3.817098 4.431813 -0.269982
C  -2.197205 -0.819498 0.633733
C  -4.232676 -0.60242 -0.801715
C  -3.453582 5.911209 -0.203379
C  -5.32463 4.25606 -0.41239
C  -0.7468 -0.525695 0.825047
C  0.226604 -1.408438 0.575993
C  1.658424 -1.158271 0.726009
C  2.078098 0.203027 1.180012
C  2.486486 -2.184634 0.434019
C  3.951225 -2.196681 0.48882
C  5.826659 -3.609736 0.157863
C  6.084939 -5.03662 -0.255359
H  -2.216221 -0.291493 -1.440674
H  -1.813848 1.774802 -0.067589
H  -3.459137 1.678049 0.519709
H  -4.31179 2.046617 -1.792974
H  -2.694116 1.909112 -2.430339
H  -1.979775 3.945278 -1.273369
H  -3.325171 4.245934 -2.34984
H  -3.511453 3.973867 0.677637
H  -2.332271 -1.894526 0.486667
H  -2.747511 -0.552993 1.543692
H  -4.227438 -1.685182 -0.941919
H  -4.889197 -0.382811 0.044355
H  -4.686183 -0.166687 -1.692707
H  -3.737383 6.429737 -1.123051
H  -2.379847 6.054426 -0.064435
H  -3.960103 6.412148 0.624257
H  -5.860412 4.78044 0.38158
H  -5.678972 4.656807 -1.366133
H  -5.626987 3.208445 -0.36422
H  -0.49176 0.469044 1.176244
H  -0.049182 -2.403348 0.236239
H  3.152182 0.318442 1.252374
H  1.645711 0.421318 2.158501
H  1.699665 0.963822 0.494492
H  2.037146 -3.119683 0.118912
H  6.225713 -3.416949 1.156485
H  6.306635 -2.913589 -0.533995
H  5.628119 -5.746866 0.434571
H  5.71338 -5.239717 -1.260297
H  7.159695 -5.21948 -0.256016
elementType: O C H
totalener: -816.42909367 hartree
nucrepener: 1368.56095488 hartree
electener: -2184.99004855 hartree
oneelecener: -3822.27200300 hartree
twoeener: 1637.28195445 hartree
cpcmener: -0.01700621 hartree
kineticenergy: 812.44040790 hartree
xcener: -82.309924470279 hartree
chargesum: -0.0000000
charge: -0.286165 -0.485575 0.108702 -0.186431 -0.136624 -0.189487 0.065738 -0.128476 -0.319785 -0.295586 -0.302224 -0.139146 -0.140368 0.009665 -0.265868 -0.163741 0.458847 0.040733 -0.252059 0.041592 0.075770 0.071073 0.071868 0.079999 0.072553 0.079645 0.034917 0.080007 0.092802 0.092479 0.084105 0.093553 0.080961 0.088258 0.088368 0.091199 0.084140 0.086980 0.128886 0.109684 0.109088 0.105125 0.103507 0.112857 0.093471 0.093371 0.087191 0.087240 0.087160
qa: -0.2862 -0.4856 0.1087 -0.1864 -0.1366 -0.1895 0.0657 -0.1285 -0.3198 -0.2956 -0.3022 -0.1391 -0.1404 0.0097 -0.2659 -0.1637 0.4588 0.0407 -0.2521 0.0416 0.0758 0.0711 0.0719 0.0800 0.0726 0.0796 0.0349 0.0800 0.0928 0.0925 0.0841 0.0936 0.0810 0.0883 0.0884 0.0912 0.0841 0.0870 0.1289 0.1097 0.1091 0.1051 0.1035 0.1129 0.0935 0.0934 0.0872 0.0872 0.0872
va: 2.1192 2.0205 3.7738 3.8996 3.8752 3.9095 3.7890 3.9207 3.9466 3.9291 3.9331 3.8874 3.9234 3.7026 3.9223 3.7759 4.1698 3.8492 3.9697 1.0251 1.0112 1.0087 1.0030 1.0107 1.0092 1.0109 1.0156 1.0171 1.0065 1.0052 1.0022 1.0017 1.0041 1.0046 1.0049 1.0056 1.0030 1.0007 0.9958 1.0240 1.0372 0.9953 0.9967 1.0329 0.9963 0.9965 1.0035 1.0034 1.0069
dispcorr: -0.018828504 hartree
energy: -816.447922173494
dipole: -28.58343 27.54230 -1.04114 18.80902 -19.20051 -0.39149 -5.27558 5.09425 -0.18133
magnitude: 1.12699 au
magnitude: 2.86459 debye
