program: Orca
programVersion: 5.0.2
elementType: O O C C C C C C C C C C C C C C C C C H H H H H H H H H H H H H H H H H H H H H H H H H H H H H H
charge: 0
multiplicity: 1
keywords: wb97x-d3
keywords: def2-TZVPP
keywords: def2/J RIJCOSX
keywords: DEFGRID2
keywords: scfconv7
keywords: smallprint printgap noloewdin
keywords: NOSOSCF
formula: C17H30O2
InChI: InChI=1/C17H30O2/c1-6-19-17(18)13-16(5)12-8-11-15(4)10-7-9-14(2)3/h8,12-15H,6-7,9-11H2,1-5H3
49 atoms
O  4.355446 -3.032072 -0.231142
O  4.366012 -1.425016 1.316302
C  -2.846479 -0.155337 -0.795584
C  -2.724082 1.304429 -0.355111
C  -2.9761 2.311084 -1.473164
C  -2.611419 3.746945 -1.105404
C  -3.386849 4.360003 0.063274
C  -2.465613 -1.133524 0.331762
C  -4.246961 -0.484763 -1.29866
C  -2.868217 5.764472 0.352059
C  -4.888461 4.389577 -0.197699
C  -1.085506 -0.919283 0.861337
C  -0.019356 -1.61308 0.447729
C  1.356075 -1.398146 0.891696
C  1.588298 -0.355539 1.938509
C  2.306548 -2.159691 0.30797
C  3.752525 -2.133525 0.547641
C  5.781254 -3.150648 -0.148247
C  6.216469 -4.183566 -1.157036
H  -2.138245 -0.320202 -1.617084
H  -1.717755 1.480102 0.040364
H  -3.41277 1.480493 0.479431
H  -4.018687 2.266379 -1.798731
H  -2.381239 2.021114 -2.34603
H  -1.540519 3.788981 -0.876417
H  -2.754689 4.383488 -1.986369
H  -3.210761 3.751441 0.957762
H  -2.558015 -2.153726 -0.050416
H  -3.189621 -1.032038 1.147127
H  -4.511445 0.093212 -2.184756
H  -4.332697 -1.539682 -1.567379
H  -4.999066 -0.277627 -0.532739
H  -3.022777 6.426175 -0.504289
H  -1.79882 5.759737 0.573875
H  -3.377438 6.212303 1.208054
H  -5.308321 3.390154 -0.323888
H  -5.423635 4.859498 0.630101
H  -5.119382 4.959438 -1.10195
H  -0.963197 -0.132807 1.598921
H  -0.164592 -2.396658 -0.29164
H  2.628002 -0.260571 2.225577
H  1.007722 -0.586501 2.833681
H  1.243625 0.618049 1.584373
H  1.985467 -2.879625 -0.436421
H  6.069411 -3.449703 0.862456
H  6.248628 -2.185601 -0.357528
H  5.768072 -5.157625 -0.958335
H  5.962778 -3.885423 -2.174853
H  7.299174 -4.300039 -1.105586
elementType: O C H
totalener: -816.42866124 hartree
nucrepener: 1379.07230525 hartree
electener: -2195.50096649 hartree
oneelecener: -3843.32760143 hartree
twoeener: 1647.82663494 hartree
cpcmener: -0.01687859 hartree
kineticenergy: 812.43873889 hartree
xcener: -82.309655059977 hartree
chargesum: -0.0000000
charge: -0.285566 -0.485222 0.101523 -0.185486 -0.135571 -0.189730 0.068103 -0.142876 -0.323381 -0.296147 -0.303080 -0.131294 -0.138522 0.007740 -0.261621 -0.163798 0.457655 0.040037 -0.251608 0.042977 0.079968 0.071607 0.072852 0.080124 0.072911 0.078849 0.034358 0.085191 0.092875 0.093709 0.091520 0.085663 0.080418 0.088060 0.088496 0.087508 0.091739 0.084185 0.127764 0.111183 0.108874 0.104849 0.102257 0.112615 0.094142 0.092657 0.087264 0.086998 0.087231
qa: -0.2856 -0.4852 0.1015 -0.1855 -0.1356 -0.1897 0.0681 -0.1429 -0.3234 -0.2961 -0.3031 -0.1313 -0.1385 0.0077 -0.2616 -0.1638 0.4577 0.0400 -0.2516 0.0430 0.0800 0.0716 0.0729 0.0801 0.0729 0.0788 0.0344 0.0852 0.0929 0.0937 0.0915 0.0857 0.0804 0.0881 0.0885 0.0875 0.0917 0.0842 0.1278 0.1112 0.1089 0.1048 0.1023 0.1126 0.0941 0.0927 0.0873 0.0870 0.0872
va: 2.1186 2.0210 3.7900 3.8837 3.8767 3.9137 3.7885 3.9230 3.9513 3.9302 3.9330 3.8773 3.8955 3.7019 3.9198 3.7742 4.1712 3.8502 3.9698 1.0231 1.0084 1.0075 1.0015 1.0101 1.0092 1.0109 1.0156 1.0148 1.0074 1.0014 1.0053 1.0018 1.0042 1.0046 1.0048 1.0007 1.0053 1.0032 0.9935 1.0235 1.0367 0.9964 0.9968 1.0330 0.9959 0.9969 1.0034 1.0034 1.0068
dispcorr: -0.019025414 hartree
energy: -816.447686654612
dipole: -26.10600 25.14234 -0.96366 19.56103 -19.84271 -0.28168 -5.86779 5.32251 -0.54529
magnitude: 1.14251 au
magnitude: 2.90402 debye
