program: Orca
programVersion: 5.0.2
elementType: O O C C C C C C C C C C C C C C C C C H H H H H H H H H H H H H H H H H H H H H H H H H H H H H H
charge: 0
multiplicity: 1
keywords: wb97x-d3
keywords: def2-TZVPP
keywords: def2/J RIJCOSX
keywords: DEFGRID2
keywords: scfconv7
keywords: smallprint printgap noloewdin
keywords: NOSOSCF
formula: C17H30O2
InChI: InChI=1/C17H30O2/c1-6-19-17(18)13-16(5)12-8-11-15(4)10-7-9-14(2)3/h8,12-15H,6-7,9-11H2,1-5H3
49 atoms
O  4.147596 -1.752945 1.168204
O  3.733739 -1.709472 -1.023954
C  -3.794174 -0.240915 0.143867
C  -3.065546 1.061222 0.469925
C  -3.663758 2.308806 -0.174913
C  -2.744389 3.533381 -0.089691
C  -1.862141 3.770739 -1.319098
C  -2.96961 -1.455804 0.599495
C  -5.19192 -0.286798 0.750021
C  -1.014426 5.023655 -1.124666
C  -0.974822 2.58074 -1.671984
C  -1.659488 -1.551076 -0.107685
C  -0.463488 -1.556445 0.485941
C  0.824856 -1.611743 -0.201362
C  0.810549 -1.606458 -1.698382
C  1.930812 -1.653087 0.567383
C  3.327722 -1.706965 0.111054
C  5.547078 -1.806895 0.899518
C  6.272049 -1.873036 2.223024
H  -3.895632 -0.305083 -0.947978
H  -2.021209 0.966013 0.166404
H  -3.041073 1.195213 1.55835
H  -4.621481 2.538371 0.298106
H  -3.898683 2.102676 -1.225802
H  -3.346446 4.432976 0.0640
H  -2.107614 3.451049 0.799007
H  -2.532409 3.946584 -2.169604
H  -3.548275 -2.365298 0.401436
H  -2.816381 -1.414929 1.6826
H  -5.146467 -0.209612 1.838816
H  -5.818164 0.52908 0.388853
H  -5.702577 -1.219965 0.506525
H  -0.315086 4.897984 -0.294684
H  -1.631531 5.89661 -0.905373
H  -0.427143 5.25017 -2.01589
H  -0.351651 2.807248 -2.538721
H  -0.305638 2.324365 -0.846977
H  -1.554315 1.689504 -1.91783
H  -1.719854 -1.596047 -1.191871
H  -0.424721 -1.509414 1.57073
H  0.306323 -0.708668 -2.062396
H  0.24567 -2.462647 -2.072178
H  1.804143 -1.639703 -2.126691
H  1.804399 -1.650176 1.643966
H  5.852517 -0.924662 0.331088
H  5.777116 -2.680391 0.284329
H  5.998536 -2.765358 2.785909
H  7.347292 -1.905776 2.048088
H  6.060572 -1.000385 2.840514
totalener: -816.41101500 hartree
nucrepener: 1421.48092302 hartree
electener: -2237.89193803 hartree
oneelecener: -3928.01238707 hartree
twoeener: 1690.12044904 hartree
kineticenergy: 812.47599679 hartree
xcener: -82.311978707436 hartree
chargesum: -0.0000000
charge: -0.268704 -0.395909 0.057242 -0.186159 -0.122541 -0.178800 0.072782 -0.117381 -0.284119 -0.269747 -0.286741 -0.130378 -0.088009 0.038791 -0.257995 -0.155158 0.401200 0.034166 -0.231996 0.033717 0.082675 0.072685 0.080545 0.063454 0.078414 0.064752 0.027030 0.089560 0.070500 0.079055 0.087886 0.083308 0.076549 0.080399 0.082295 0.094213 0.083735 0.067203 0.094850 0.073844 0.083008 0.090800 0.125065 0.093685 0.084549 0.084038 0.082502 0.076899 0.082240
qa: -0.2687 -0.3959 0.0572 -0.1862 -0.1225 -0.1788 0.0728 -0.1174 -0.2841 -0.2697 -0.2867 -0.1304 -0.0880 0.0388 -0.2580 -0.1552 0.4012 0.0342 -0.2320 0.0337 0.0827 0.0727 0.0805 0.0635 0.0784 0.0648 0.0270 0.0896 0.0705 0.0791 0.0879 0.0833 0.0765 0.0804 0.0823 0.0942 0.0837 0.0672 0.0949 0.0738 0.0830 0.0908 0.1251 0.0937 0.0845 0.0840 0.0825 0.0769 0.0822
va: 2.1254 2.1078 3.7965 3.8806 3.8507 3.9088 3.8462 3.9280 3.9577 3.9464 3.9399 3.8878 3.9200 3.6722 3.9191 3.8160 4.2265 3.8826 3.9548 1.0233 0.9981 1.0199 1.0092 1.0091 1.0090 1.0109 1.0161 1.0082 1.0186 1.0040 1.0048 1.0078 1.0056 1.0077 1.0077 1.0100 1.0016 1.0042 1.0120 1.0305 0.9976 0.9981 1.0409 1.0358 0.9990 0.9996 1.0053 1.0086 1.0055
dispcorr: -0.020288489 hartree
energy: -816.431303491246
dipole: -18.83560 18.25405 -0.58156 16.77992 -16.66659 0.11333 -0.98799 1.44899 0.46099
magnitude: 0.75071 au
magnitude: 1.90816 debye
