program: Orca
programVersion: 5.0.2
elementType: O O C C C C C C C C C C C C C C C C C H H H H H H H H H H H H H H H H H H H H H H H H H H H H H H
charge: 0
multiplicity: 1
keywords: wb97x-d3
keywords: def2-TZVPP
keywords: def2/J RIJCOSX
keywords: DEFGRID2
keywords: scfconv7
keywords: smallprint printgap noloewdin
keywords: NOSOSCF
formula: C17H30O2
InChI: InChI=1/C17H30O2/c1-6-19-17(18)13-16(5)12-8-11-15(4)10-7-9-14(2)3/h8,12-15H,6-7,9-11H2,1-5H3
49 atoms
O  4.015988 -1.28007 1.415726
O  3.773881 -1.089374 -0.800202
C  -3.7815 -0.080874 0.128392
C  -3.172782 1.017016 1.005586
C  -3.476547 2.445834 0.559304
C  -2.923728 2.819286 -0.817389
C  -1.430039 2.560183 -1.027002
C  -3.032202 -1.411853 0.316692
C  -5.270165 -0.253736 0.406853
C  -1.017976 2.949848 -2.442504
C  -0.567071 3.285951 -0.001169
C  -1.67328 -1.368505 -0.295806
C  -0.5212 -1.395278 0.379145
C  0.811468 -1.281983 -0.210429
C  0.900924 -1.123752 -1.695958
C  1.858466 -1.312328 0.636938
C  3.285867 -1.21334 0.295357
C  5.435677 -1.229517 1.293075
C  6.02976 -2.569561 0.910299
H  -3.668401 0.203974 -0.924399
H  -2.088583 0.885815 1.057044
H  -3.532486 0.879093 2.031242
H  -3.077187 3.133348 1.309595
H  -4.55713 2.61735 0.558974
H  -3.481154 2.286242 -1.594581
H  -3.125073 3.881654 -0.994724
H  -1.248943 1.484439 -0.915899
H  -3.610599 -2.214282 -0.153743
H  -2.969404 -1.654297 1.382099
H  -5.72397 -0.97763 -0.271755
H  -5.438105 -0.605157 1.427457
H  -5.812357 0.685499 0.291505
H  -1.605067 2.417787 -3.193248
H  0.034018 2.724737 -2.625784
H  -1.159171 4.019532 -2.612951
H  -0.780004 2.96637 1.019492
H  0.492968 3.101756 -0.18089
H  -0.72748 4.365791 -0.049734
H  -1.655811 -1.264775 -1.377185
H  -0.557933 -1.496902 1.46034
H  0.37213 -0.219658 -2.006666
H  0.41346 -1.963454 -2.194678
H  1.922276 -1.060281 -2.048963
H  1.652302 -1.425255 1.694868
H  5.786442 -0.925667 2.279273
H  5.729855 -0.458475 0.578545
H  5.736205 -3.348077 1.614293
H  5.728861 -2.872158 -0.090869
H  7.1182 -2.501571 0.924599
totalener: -816.41175956 hartree
nucrepener: 1466.94865356 hartree
electener: -2283.36041312 hartree
oneelecener: -4018.92715987 hartree
twoeener: 1735.56674676 hartree
kineticenergy: 812.47665257 hartree
xcener: -82.316871112998 hartree
chargesum: 0.0000000
charge: -0.272000 -0.402745 0.027964 -0.146580 -0.179034 -0.170947 0.123307 -0.128161 -0.273181 -0.279103 -0.275585 -0.103827 -0.121083 0.043292 -0.260489 -0.158253 0.415309 0.031781 -0.253905 0.043517 0.075418 0.080789 0.081521 0.075180 0.072209 0.077423 -0.050629 0.086897 0.074551 0.083340 0.078067 0.086798 0.082368 0.087167 0.083239 0.078852 0.089300 0.084550 0.097728 0.081176 0.082540 0.092632 0.126034 0.093827 0.093848 0.083661 0.082030 0.099327 0.079881
qa: -0.2720 -0.4027 0.0280 -0.1466 -0.1790 -0.1709 0.1233 -0.1282 -0.2732 -0.2791 -0.2756 -0.1038 -0.1211 0.0433 -0.2605 -0.1583 0.4153 0.0318 -0.2539 0.0435 0.0754 0.0808 0.0815 0.0752 0.0722 0.0774 -0.0506 0.0869 0.0746 0.0833 0.0781 0.0868 0.0824 0.0872 0.0832 0.0789 0.0893 0.0846 0.0977 0.0812 0.0825 0.0926 0.1260 0.0938 0.0938 0.0837 0.0820 0.0993 0.0799
va: 2.1285 2.0948 3.7689 3.8506 3.9365 3.8861 3.8024 3.9375 3.9540 3.9329 3.9404 3.8526 3.9087 3.6607 3.9227 3.8103 4.2239 3.8836 3.9123 1.0208 1.0080 1.0133 1.0034 1.0114 1.0062 1.0142 1.0467 1.0082 1.0175 1.0074 1.0046 1.0070 1.0053 1.0064 1.0089 1.0053 1.0090 1.0051 1.0089 1.0287 0.9920 0.9981 1.0403 1.0372 0.9944 1.0129 1.0053 1.0134 1.0102
dispcorr: -0.022433101 hartree
energy: -816.434192657573
dipole: -18.70377 18.14261 -0.56115 12.17261 -12.23152 -0.05891 -3.32206 3.73258 0.41052
magnitude: 0.69777 au
magnitude: 1.77360 debye
