program: Orca
programVersion: 5.0.2
elementType: O O C C C C C C C C C C C C C C C C C H H H H H H H H H H H H H H H H H H H H H H H H H H H H H H
charge: 0
multiplicity: 1
keywords: wb97x-d3
keywords: def2-TZVPP
keywords: def2/J RIJCOSX
keywords: DEFGRID2
keywords: scfconv7
keywords: smallprint printgap noloewdin
keywords: NOSOSCF
formula: C17H30O2
InChI: InChI=1/C17H30O2/c1-6-19-17(18)13-16(5)12-8-11-15(4)10-7-9-14(2)3/h8,12-15H,6-7,9-11H2,1-5H3
49 atoms
O  5.257894 -2.474408 1.250213
O  3.889321 -4.079445 0.505698
C  -1.828806 1.124077 -0.358652
C  -2.548236 2.413146 -0.759812
C  -3.95946 2.553434 -0.199865
C  -4.668077 3.802906 -0.709548
C  -6.055863 4.044025 -0.112581
C  -0.499412 0.99994 -1.120927
C  -1.602843 1.037271 1.146394
C  -6.594237 5.401773 -0.552196
C  -7.042099 2.938792 -0.477464
C  0.163635 -0.321731 -0.925864
C  1.37365 -0.498758 -0.389431
C  2.031938 -1.78614 -0.176352
C  1.287295 -3.020448 -0.579639
C  3.261317 -1.761103 0.374731
C  4.121902 -2.911128 0.691682
C  6.236765 -3.443304 1.618865
C  7.083303 -3.882941 0.441717
H  -2.463671 0.280294 -0.659459
H  -2.600545 2.462678 -1.853104
H  -1.943852 3.273867 -0.449599
H  -3.931215 2.585523 0.89345
H  -4.533895 1.659848 -0.462936
H  -4.038492 4.673641 -0.495319
H  -4.751908 3.757296 -1.802148
H  -5.952372 4.060243 0.97931
H  0.173134 1.809754 -0.820816
H  -0.697141 1.14064 -2.189733
H  -2.542242 1.043839 1.698534
H  -1.070902 0.126423 1.421552
H  -1.00677 1.883162 1.498436
H  -6.713354 5.442825 -1.637459
H  -5.921955 6.21172 -0.26459
H  -7.569007 5.608844 -0.107966
H  -8.029235 3.139382 -0.058245
H  -7.156186 2.861631 -1.561634
H  -6.72811 1.962412 -0.108172
H  -0.414466 -1.185488 -1.242938
H  1.931887 0.379063 -0.075855
H  1.051472 -2.984666 -1.644965
H  0.336483 -3.074585 -0.045934
H  1.843432 -3.928027 -0.382352
H  3.68663 -0.795736 0.623645
H  5.762441 -4.303176 2.095407
H  6.853038 -2.942664 2.365578
H  7.874143 -4.548748 0.789498
H  6.49411 -4.424148 -0.296349
H  7.556255 -3.030264 -0.04522
totalener: -816.41455474 hartree
nucrepener: 1340.85744201 hartree
electener: -2157.27199675 hartree
oneelecener: -3766.70586471 hartree
twoeener: 1609.43386796 hartree
kineticenergy: 812.47172030 hartree
xcener: -82.311029663872 hartree
chargesum: -0.0000000
charge: -0.272529 -0.402998 0.088023 -0.167699 -0.112609 -0.150788 0.051876 -0.110141 -0.307786 -0.265796 -0.274494 -0.146907 -0.085347 0.038067 -0.268337 -0.160665 0.417106 0.030985 -0.254462 0.035508 0.065363 0.066230 0.062197 0.061796 0.064320 0.061576 0.025185 0.069207 0.087684 0.090400 0.098090 0.077045 0.075559 0.080666 0.082835 0.084281 0.076977 0.082584 0.096750 0.072824 0.090722 0.089058 0.123961 0.093926 0.083453 0.094674 0.079716 0.099887 0.082029
qa: -0.2725 -0.4030 0.0880 -0.1677 -0.1126 -0.1508 0.0519 -0.1101 -0.3078 -0.2658 -0.2745 -0.1469 -0.0853 0.0381 -0.2683 -0.1607 0.4171 0.0310 -0.2545 0.0355 0.0654 0.0662 0.0622 0.0618 0.0643 0.0616 0.0252 0.0692 0.0877 0.0904 0.0981 0.0770 0.0756 0.0807 0.0828 0.0843 0.0770 0.0826 0.0968 0.0728 0.0907 0.0891 0.1240 0.0939 0.0835 0.0947 0.0797 0.0999 0.0820
va: 2.1275 2.0945 3.7645 3.9164 3.8666 3.9019 3.8543 3.9350 3.9550 3.9404 3.9319 3.9075 3.9586 3.6754 3.9227 3.8065 4.2214 3.8834 3.9124 1.0220 1.0148 1.0131 1.0125 1.0111 1.0138 1.0148 1.0170 1.0193 1.0083 1.0048 1.0056 1.0059 1.0056 1.0074 1.0077 1.0073 1.0052 1.0058 1.0114 1.0318 0.9973 0.9978 1.0401 1.0369 1.0132 0.9942 1.0103 1.0129 1.0053
dispcorr: -0.018454983 hartree
energy: -816.433009726436
dipole: -32.29695 32.02550 -0.27145 21.74176 -21.04369 0.69808 -3.48430 3.45542 -0.02888
magnitude: 0.74955 au
magnitude: 1.90521 debye
