program: Orca
programVersion: 5.0.2
elementType: O O C C C C C C C C C C C C C C C C C H H H H H H H H H H H H H H H H H H H H H H H H H H H H H H
charge: 0
multiplicity: 1
keywords: wb97x-d3
keywords: def2-TZVPP
keywords: def2/J RIJCOSX
keywords: DEFGRID2
keywords: scfconv7
keywords: smallprint printgap noloewdin
keywords: NOSOSCF
formula: C17H30O2
InChI: InChI=1/C17H30O2/c1-6-19-17(18)13-16(5)12-8-11-15(4)10-7-9-14(2)3/h8,12-15H,6-7,9-11H2,1-5H3
49 atoms
O  4.779783 -1.899772 0.821244
O  3.91275 -3.417282 -0.575852
C  -2.679931 0.492647 0.006762
C  -3.692515 1.386167 0.726648
C  -4.182864 2.606671 -0.05012
C  -3.066745 3.551523 -0.481635
C  -3.540435 4.840218 -1.158077
C  -2.202436 -0.609619 0.967245
C  -3.247138 -0.085057 -1.283847
C  -4.313943 5.745302 -0.20466
C  -2.354933 5.593104 -1.753707
C  -1.128714 -1.474677 0.393256
C  0.16448 -1.351233 0.702525
C  1.259272 -2.142975 0.147426
C  0.914556 -3.205336 -0.848996
C  2.501284 -1.847717 0.577864
C  3.761966 -2.495658 0.186762
C  6.094607 -2.402208 0.595897
C  6.391723 -3.633419 1.427499
H  -1.798426 1.092158 -0.244815
H  -3.246825 1.730506 1.666426
H  -4.557666 0.777083 1.012265
H  -4.894277 3.138237 0.587098
H  -4.754112 2.293671 -0.929712
H  -2.45048 3.810899 0.388401
H  -2.399017 3.027354 -1.172879
H  -4.210355 4.560808 -1.980625
H  -3.061145 -1.228175 1.25181
H  -1.839232 -0.140129 1.88576
H  -3.553185 0.699835 -1.975811
H  -2.515675 -0.699605 -1.809495
H  -4.12356 -0.706948 -1.084347
H  -4.63927 6.657339 -0.707282
H  -3.689555 6.042505 0.64142
H  -5.205981 5.264015 0.196473
H  -1.813395 4.980963 -2.476534
H  -2.674069 6.502879 -2.264202
H  -1.647335 5.885399 -0.974291
H  -1.437363 -2.221916 -0.330486
H  0.448235 -0.597798 1.43259
H  1.785264 -3.737087 -1.211243
H  0.399332 -2.763336 -1.704023
H  0.228153 -3.928376 -0.4045
H  2.610965 -1.047155 1.299981
H  6.754955 -1.582743 0.879745
H  6.248536 -2.606997 -0.465286
H  7.437918 -3.914547 1.301184
H  6.223835 -3.44366 2.487544
H  5.78049 -4.480817 1.123086
totalener: -816.41225931 hartree
nucrepener: 1368.11548268 hartree
electener: -2184.52774198 hartree
oneelecener: -3821.20821740 hartree
twoeener: 1636.68047541 hartree
kineticenergy: 812.47933339 hartree
xcener: -82.313734260768 hartree
chargesum: -0.0000000
charge: -0.272150 -0.402488 0.096017 -0.198610 -0.134997 -0.148835 0.044012 -0.151887 -0.307011 -0.270500 -0.258778 -0.116676 -0.087723 0.029314 -0.266703 -0.155625 0.411302 0.030902 -0.254356 0.050389 0.074018 0.077778 0.079277 0.069101 0.067027 0.065237 0.024984 0.087413 0.073246 0.086285 0.088003 0.083923 0.083635 0.076375 0.081601 0.079586 0.082642 0.075827 0.101212 0.071445 0.123840 0.087426 0.091496 0.093595 0.093864 0.083614 0.079852 0.081979 0.100121
qa: -0.2722 -0.4025 0.0960 -0.1986 -0.1350 -0.1488 0.0440 -0.1519 -0.3070 -0.2705 -0.2588 -0.1167 -0.0877 0.0293 -0.2667 -0.1556 0.4113 0.0309 -0.2544 0.0504 0.0740 0.0778 0.0793 0.0691 0.0670 0.0652 0.0250 0.0874 0.0732 0.0863 0.0880 0.0839 0.0836 0.0764 0.0816 0.0796 0.0826 0.0758 0.1012 0.0714 0.1238 0.0874 0.0915 0.0936 0.0939 0.0836 0.0799 0.0820 0.1001
va: 2.1270 2.0958 3.7354 3.9430 3.8726 3.8691 3.8686 3.9677 3.9673 3.9351 3.9312 3.8949 3.9479 3.6826 3.9237 3.8049 4.2246 3.8844 3.9112 1.0224 1.0097 1.0116 1.0172 1.0064 1.0136 1.0135 1.0162 1.0104 1.0201 1.0052 1.0064 1.0027 1.0072 1.0055 1.0079 1.0080 1.0080 1.0057 1.0031 1.0312 1.0394 0.9981 0.9975 1.0372 0.9943 1.0128 1.0103 1.0055 1.0130
dispcorr: -0.018977854 hartree
energy: -816.431237160692
dipole: -24.85254 24.36526 -0.48728 22.03677 -21.51289 0.52388 -3.32762 3.62805 0.30043
magnitude: 0.77599 au
magnitude: 1.97240 debye
