program: Orca
programVersion: 5.0.2
elementType: O O C C C C C C C C C C C C C C C C C H H H H H H H H H H H H H H H H H H H H H H H H H H H H H H
charge: 0
multiplicity: 1
keywords: wb97x-d3
keywords: def2-TZVPP
keywords: def2/J RIJCOSX
keywords: DEFGRID2
keywords: scfconv7
keywords: smallprint printgap noloewdin
keywords: NOSOSCF
formula: C17H30O2
InChI: InChI=1/C17H30O2/c1-6-19-17(18)13-16(5)12-8-11-15(4)10-7-9-14(2)3/h8,12-15H,6-7,9-11H2,1-5H3
49 atoms
O  4.259856 -2.647592 -0.473307
O  3.937173 -1.908692 1.609476
C  -3.022911 -0.212124 -0.814992
C  -2.995088 1.009357 0.103791
C  -3.087216 2.347659 -0.621697
C  -2.840719 3.525773 0.313353
C  -2.956818 4.907383 -0.332353
C  -2.748823 -1.515209 -0.041692
C  -4.336671 -0.330112 -1.579429
C  -2.81042 5.996432 0.725425
C  -1.933083 5.112236 -1.444879
C  -1.448501 -1.491174 0.695938
C  -0.294154 -1.922243 0.181099
C  1.011559 -1.833849 0.830565
C  1.058902 -1.25886 2.212075
C  2.077812 -2.254925 0.122518
C  3.488005 -2.236154 0.539848
C  5.667905 -2.681529 -0.252578
C  6.324652 -3.129855 -1.53749
H  -2.209648 -0.098686 -1.542452
H  -2.061823 1.002284 0.675771
H  -3.803661 0.930601 0.840853
H  -4.067574 2.46274 -1.093982
H  -2.353961 2.355311 -1.434091
H  -3.548576 3.466394 1.147593
H  -1.844286 3.427911 0.761153
H  -3.958565 4.992153 -0.770983
H  -2.75542 -2.347922 -0.750315
H  -3.570726 -1.695815 0.658676
H  -5.183687 -0.415191 -0.894637
H  -4.51508 0.534648 -2.218155
H  -4.34346 -1.212339 -2.221646
H  -2.920541 6.99195 0.292893
H  -1.826352 5.951206 1.197707
H  -3.558167 5.893775 1.513538
H  -2.00828 6.115013 -1.868031
H  -0.915748 4.993207 -1.063836
H  -2.062878 4.406095 -2.265062
H  -1.458721 -1.053533 1.688471
H  -0.302959 -2.360217 -0.813715
H  0.42015 -1.838662 2.880834
H  0.66942 -0.238932 2.205949
H  2.059728 -1.240558 2.624282
H  1.905342 -2.639213 -0.876108
H  5.90233 -3.366549 0.566173
H  6.025586 -1.692381 0.043871
H  6.114732 -2.44095 -2.355283
H  7.405488 -3.167669 -1.402474
H  5.990175 -4.123832 -1.833285
totalener: -816.41321794 hartree
nucrepener: 1375.49821008 hartree
electener: -2191.91142803 hartree
oneelecener: -3835.97220555 hartree
twoeener: 1644.06077752 hartree
kineticenergy: 812.47653385 hartree
xcener: -82.311027978691 hartree
chargesum: -0.0000000
charge: -0.268125 -0.394698 0.082778 -0.162204 -0.121092 -0.152168 0.055842 -0.157336 -0.289956 -0.265960 -0.277198 -0.117414 -0.090780 0.031671 -0.263900 -0.150896 0.397081 0.034519 -0.231258 0.039311 0.068840 0.066940 0.062861 0.064658 0.065257 0.060708 0.025347 0.081508 0.087136 0.080254 0.087683 0.084156 0.082276 0.075850 0.080397 0.083370 0.079311 0.082682 0.103321 0.074538 0.091051 0.086200 0.124577 0.093638 0.084922 0.083249 0.082278 0.076622 0.082158
qa: -0.2681 -0.3947 0.0828 -0.1622 -0.1211 -0.1522 0.0558 -0.1573 -0.2900 -0.2660 -0.2772 -0.1174 -0.0908 0.0317 -0.2639 -0.1509 0.3971 0.0345 -0.2313 0.0393 0.0688 0.0669 0.0629 0.0647 0.0653 0.0607 0.0253 0.0815 0.0871 0.0803 0.0877 0.0842 0.0823 0.0758 0.0804 0.0834 0.0793 0.0827 0.1033 0.0745 0.0911 0.0862 0.1246 0.0936 0.0849 0.0832 0.0823 0.0766 0.0822
va: 2.1243 2.1095 3.8123 3.9053 3.8843 3.9014 3.8513 3.9423 3.9523 3.9410 3.9329 3.8793 3.9292 3.6798 3.9216 3.8133 4.2272 3.8830 3.9545 1.0229 1.0147 1.0121 1.0111 1.0101 1.0133 1.0148 1.0168 1.0162 1.0107 1.0036 1.0049 1.0076 1.0079 1.0057 1.0074 1.0076 1.0049 1.0054 1.0002 1.0304 0.9980 0.9981 1.0400 1.0360 0.9990 0.9997 1.0055 1.0088 1.0055
dispcorr: -0.018452381 hartree
energy: -816.431670324116
dipole: -21.45301 20.88023 -0.57278 22.13673 -22.08839 0.04833 -6.00588 5.41538 -0.59050
magnitude: 0.82408 au
magnitude: 2.09464 debye
