program: Orca
programVersion: 5.0.2
elementType: O O C C C C C C C C C C C C C C C C C H H H H H H H H H H H H H H H H H H H H H H H H H H H H H H
charge: 0
multiplicity: 1
keywords: wb97x-d3
keywords: def2-TZVPP
keywords: def2/J RIJCOSX
keywords: DEFGRID2
keywords: scfconv7
keywords: smallprint printgap noloewdin
keywords: NOSOSCF
formula: C17H30O2
InChI: InChI=1/C17H30O2/c1-6-19-17(18)13-16(5)12-8-11-15(4)10-7-9-14(2)3/h8,12-15H,6-7,9-11H2,1-5H3
49 atoms
O  4.020065 -1.510317 1.423278
O  3.694516 -1.404425 -0.787295
C  -4.067051 -0.429063 0.092729
C  -3.65525 1.014833 0.397681
C  -2.534809 1.595059 -0.459811
C  -2.307939 3.075689 -0.177071
C  -1.088571 3.683031 -0.87166
C  -3.064355 -1.477804 0.599573
C  -5.439973 -0.717515 0.694531
C  -1.184949 3.59227 -2.391112
C  -0.896927 5.131036 -0.433236
C  -1.731981 -1.46218 -0.069882
C  -0.557648 -1.466512 0.566127
C  0.754419 -1.450226 -0.075426
C  0.79281 -1.399281 -1.570979
C  1.83262 -1.470499 0.732662
C  3.246839 -1.45846 0.330963
C  5.433943 -1.520845 1.239555
C  5.961341 -2.894982 0.881177
H  -4.148567 -0.538943 -0.996447
H  -3.384999 1.093227 1.457447
H  -4.537697 1.652219 0.272987
H  -2.784097 1.448091 -1.515427
H  -1.60228 1.053862 -0.287545
H  -3.202377 3.644316 -0.459611
H  -2.196519 3.213191 0.904209
H  -0.206402 3.114365 -0.553486
H  -3.509273 -2.467286 0.437137
H  -2.943336 -1.375028 1.682741
H  -5.422997 -0.606209 1.781032
H  -6.19369 -0.031164 0.307396
H  -5.772925 -1.732647 0.472843
H  -2.082048 4.099075 -2.755459
H  -1.22231 2.56053 -2.741453
H  -0.325157 4.063849 -2.869073
H  -1.749388 5.746239 -0.730692
H  -0.796659 5.211213 0.650389
H  -0.003782 5.569826 -0.880524
H  -1.753342 -1.461867 -1.156146
H  -0.557833 -1.467695 1.652603
H  1.801412 -1.386448 -1.963645
H  0.272658 -0.507107 -1.926297
H  0.268767 -2.260297 -1.98997
H  1.665462 -1.505562 1.80284
H  5.838535 -1.196452 2.198217
H  5.725932 -0.78749 0.485426
H  5.605947 -3.220431 -0.094569
H  7.05115 -2.868388 0.846573
H  5.670464 -3.636745 1.624893
totalener: -816.41198384 hartree
nucrepener: 1424.71608627 hartree
electener: -2241.12807011 hartree
oneelecener: -3934.50466806 hartree
twoeener: 1693.37659795 hartree
kineticenergy: 812.48157926 hartree
xcener: -82.313708620289 hartree
chargesum: -0.0000000
charge: -0.272540 -0.403887 0.062016 -0.165184 -0.087430 -0.163179 0.057694 -0.119879 -0.268746 -0.274111 -0.266017 -0.143809 -0.093426 0.036341 -0.257637 -0.164233 0.418305 0.032534 -0.254264 0.033054 0.061959 0.069001 0.063472 0.053328 0.063076 0.064204 0.029094 0.089773 0.069372 0.081556 0.082327 0.081133 0.077176 0.079204 0.084971 0.074338 0.080453 0.082794 0.104396 0.071945 0.125338 0.083486 0.090365 0.093797 0.093679 0.083291 0.099467 0.079751 0.081653
qa: -0.2725 -0.4039 0.0620 -0.1652 -0.0874 -0.1632 0.0577 -0.1199 -0.2687 -0.2741 -0.2660 -0.1438 -0.0934 0.0363 -0.2576 -0.1642 0.4183 0.0325 -0.2543 0.0331 0.0620 0.0690 0.0635 0.0533 0.0631 0.0642 0.0291 0.0898 0.0694 0.0816 0.0823 0.0811 0.0772 0.0792 0.0850 0.0743 0.0805 0.0828 0.1044 0.0719 0.1253 0.0835 0.0904 0.0938 0.0937 0.0833 0.0995 0.0798 0.0817
va: 2.1278 2.0937 3.8042 3.9290 3.8419 3.9144 3.8438 3.9171 3.9434 3.9357 3.9454 3.9142 3.9361 3.6847 3.9189 3.8095 4.2220 3.8840 3.9117 1.0216 1.0141 1.0091 1.0117 1.0247 1.0139 1.0135 1.0183 1.0052 1.0181 1.0032 1.0080 1.0078 1.0051 1.0059 1.0082 1.0058 1.0075 1.0075 1.0074 1.0316 1.0405 0.9973 0.9979 1.0369 0.9944 1.0129 1.0136 1.0102 1.0054
dispcorr: -0.019915471 hartree
energy: -816.431899314094
dipole: -19.17581 18.59444 -0.58137 14.73354 -14.79826 -0.06472 -4.02558 4.43159 0.40601
magnitude: 0.71205 au
magnitude: 1.80990 debye
