program: Orca
programVersion: 5.0.2
elementType: O O C C C C C C C C C C C C C C C C C H H H H H H H H H H H H H H H H H H H H H H H H H H H H H H
charge: 0
multiplicity: 1
keywords: wb97x-d3
keywords: def2-TZVPP
keywords: def2/J RIJCOSX
keywords: DEFGRID2
keywords: scfconv7
keywords: smallprint printgap noloewdin
keywords: NOSOSCF
formula: C17H30O2
InChI: InChI=1/C17H30O2/c1-6-19-17(18)13-16(5)12-8-11-15(4)10-7-9-14(2)3/h8,12-15H,6-7,9-11H2,1-5H3
49 atoms
O  4.896956 -2.036116 0.99759
O  3.748282 -3.921628 0.636512
C  -2.858383 0.137282 0.091591
C  -3.934554 1.12263 -0.375341
C  -3.525054 2.591629 -0.410804
C  -4.677415 3.485242 -0.859819
C  -4.37266 4.984971 -0.937418
C  -1.637202 0.139687 -0.841872
C  -2.444012 0.368997 1.540604
C  -4.015098 5.575442 0.423258
C  -3.299025 5.307781 -1.972218
C  -0.733405 -1.023253 -0.608292
C  0.543367 -0.93466 -0.227726
C  1.441932 -2.062546 0.008593
C  0.889757 -3.441375 -0.179842
C  2.704629 -1.770294 0.376761
C  3.79217 -2.717175 0.666836
C  6.068352 -2.78025 1.325002
C  6.834754 -3.223157 0.095547
H  -3.309562 -0.860948 0.032655
H  -4.807964 1.014259 0.276633
H  -4.272315 0.825606 -1.374455
H  -2.673706 2.721186 -1.085159
H  -3.181254 2.902753 0.579271
H  -5.02468 3.147457 -1.842493
H  -5.523079 3.336385 -0.17936
H  -5.298654 5.468649 -1.268282
H  -1.079489 1.073716 -0.731047
H  -1.989712 0.107752 -1.879658
H  -1.929882 1.323786 1.664369
H  -3.310794 0.37226 2.203133
H  -1.763598 -0.408475 1.888721
H  -4.77607 5.34597 1.17137
H  -3.926405 6.66144 0.368033
H  -3.061922 5.194333 0.794283
H  -2.324517 4.909276 -1.684586
H  -3.549389 4.894582 -2.950879
H  -3.181981 6.385973 -2.091245
H  -1.181875 -2.001622 -0.757966
H  0.969692 0.05346 -0.078569
H  1.622431 -4.214689 0.012822
H  0.520512 -3.561347 -1.200176
H  0.039117 -3.59819 0.4860
H  2.975822 -0.725697 0.4758
H  5.813281 -3.638085 1.949915
H  6.671448 -2.096675 1.922613
H  6.270845 -3.945627 -0.491507
H  7.086002 -2.374794 -0.54096
H  7.768172 -3.697783 0.400517
totalener: -816.41193686 hartree
nucrepener: 1366.29852601 hartree
electener: -2182.71046287 hartree
oneelecener: -3817.60903684 hartree
twoeener: 1634.89857397 hartree
kineticenergy: 812.47564568 hartree
xcener: -82.314257811759 hartree
chargesum: -0.0000000
charge: -0.272588 -0.402986 0.097367 -0.168541 -0.157012 -0.154300 0.065197 -0.119958 -0.313360 -0.289462 -0.291139 -0.166331 -0.075182 0.036383 -0.267584 -0.160360 0.416927 0.031952 -0.254203 0.049357 0.074517 0.072515 0.074928 0.074815 0.070958 0.071348 0.039773 0.062418 0.092928 0.073096 0.092197 0.098834 0.087008 0.087751 0.072194 0.071856 0.087572 0.087851 0.095262 0.072936 0.124400 0.089565 0.088953 0.093872 0.083412 0.093535 0.099418 0.082017 0.079893
qa: -0.2726 -0.4030 0.0974 -0.1685 -0.1570 -0.1543 0.0652 -0.1200 -0.3134 -0.2895 -0.2911 -0.1663 -0.0752 0.0364 -0.2676 -0.1604 0.4169 0.0320 -0.2542 0.0494 0.0745 0.0725 0.0749 0.0748 0.0710 0.0713 0.0398 0.0624 0.0929 0.0731 0.0922 0.0988 0.0870 0.0878 0.0722 0.0719 0.0876 0.0879 0.0953 0.0729 0.1244 0.0896 0.0890 0.0939 0.0834 0.0935 0.0994 0.0820 0.0799
va: 2.1275 2.0949 3.7527 3.9041 3.8647 3.8994 3.8407 3.9513 3.9604 3.9500 3.9501 3.9406 3.9552 3.6784 3.9233 3.8061 4.2229 3.8842 3.9122 1.0164 1.0129 1.0113 1.0001 0.9975 1.0118 1.0117 1.0096 1.0162 1.0056 1.0021 1.0051 1.0055 1.0048 1.0075 1.0011 1.0019 1.0046 1.0075 1.0126 1.0305 1.0397 0.9975 0.9979 1.0369 1.0136 0.9942 1.0129 1.0054 1.0103
dispcorr: -0.019209297 hartree
energy: -816.431146155658
dipole: -24.76400 24.33457 -0.42943 23.14370 -22.47733 0.66636 -3.61440 3.49677 -0.11764
magnitude: 0.80143 au
magnitude: 2.03707 debye
