program: Orca
programVersion: 5.0.2
elementType: O O C C C C C C C C C C C C C C C C C H H H H H H H H H H H H H H H H H H H H H H H H H H H H H H
charge: 0
multiplicity: 1
keywords: wb97x-d3
keywords: def2-TZVPP
keywords: def2/J RIJCOSX
keywords: DEFGRID2
keywords: scfconv7
keywords: smallprint printgap noloewdin
keywords: NOSOSCF
formula: C17H30O2
InChI: InChI=1/C17H30O2/c1-6-19-17(18)13-16(5)12-8-11-15(4)10-7-9-14(2)3/h8,12-15H,6-7,9-11H2,1-5H3
49 atoms
O  5.090849 -2.595791 -0.260171
O  3.822156 -3.981052 0.954908
C  -2.321874 0.351785 -0.884078
C  -2.916861 1.634881 -1.473923
C  -3.623021 2.563573 -0.491079
C  -4.184849 3.80088 -1.182843
C  -4.979925 4.745885 -0.280859
C  -1.218312 0.662612 0.142307
C  -3.395906 -0.567205 -0.309345
C  -4.126212 5.33524 0.837889
C  -5.609735 5.861851 -1.108926
C  -0.427574 -0.538918 0.541778
C  0.852904 -0.730172 0.214067
C  1.660951 -1.898135 0.557726
C  1.004319 -2.991062 1.342066
C  2.939953 -1.90029 0.133801
C  3.949951 -2.948269 0.34645
C  6.200246 -3.486709 -0.171903
C  6.959882 -3.335166 1.129748
H  -1.842357 -0.178755 -1.714228
H  -3.621065 1.354632 -2.26467
H  -2.117767 2.193261 -1.973736
H  -2.926663 2.865823 0.295669
H  -4.439165 2.033265 0.010235
H  -3.364811 4.360036 -1.649618
H  -4.83125 3.477803 -2.006521
H  -5.790987 4.167508 0.178361
H  -1.671637 1.105501 1.035782
H  -0.545787 1.418918 -0.272914
H  -3.858604 -0.143348 0.583947
H  -4.188876 -0.743766 -1.037685
H  -2.991261 -1.542024 -0.035547
H  -3.723039 4.569688 1.501013
H  -4.707632 6.021985 1.454873
H  -3.282698 5.89645 0.428532
H  -4.842136 6.469072 -1.594426
H  -6.257498 5.464174 -1.89185
H  -6.211834 6.528413 -0.489673
H  -0.950419 -1.293277 1.121243
H  1.356678 0.041614 -0.361623
H  0.646491 -2.603957 2.297976
H  1.668723 -3.823166 1.537319
H  0.130893 -3.363996 0.803811
H  3.28882 -1.044227 -0.431876
H  6.835714 -3.219842 -1.016303
H  5.873474 -4.519016 -0.309738
H  7.276533 -2.303843 1.284806
H  6.36127 -3.648797 1.982911
H  7.855322 -3.957211 1.103331
totalener: -816.41248587 hartree
nucrepener: 1351.13595199 hartree
electener: -2167.54843786 hartree
oneelecener: -3787.23245861 hartree
twoeener: 1619.68402074 hartree
kineticenergy: 812.47131464 hartree
xcener: -82.311864704277 hartree
chargesum: -0.0000000
charge: -0.272559 -0.402621 0.109074 -0.171500 -0.118617 -0.161426 0.059926 -0.158277 -0.315455 -0.276494 -0.267046 -0.135860 -0.080459 0.031841 -0.269677 -0.160662 0.414654 0.030946 -0.254543 0.057400 0.073785 0.073616 0.066179 0.066153 0.062229 0.064230 0.025389 0.087312 0.075827 0.079955 0.091025 0.085058 0.081905 0.083736 0.078218 0.076095 0.080845 0.081974 0.100304 0.070401 0.090551 0.124536 0.088559 0.093716 0.093932 0.083653 0.082394 0.100002 0.079774
qa: -0.2726 -0.4026 0.1091 -0.1715 -0.1186 -0.1614 0.0599 -0.1583 -0.3155 -0.2765 -0.2670 -0.1359 -0.0805 0.0318 -0.2697 -0.1607 0.4147 0.0309 -0.2545 0.0574 0.0738 0.0736 0.0662 0.0662 0.0622 0.0642 0.0254 0.0873 0.0758 0.0800 0.0910 0.0851 0.0819 0.0837 0.0782 0.0761 0.0808 0.0820 0.1003 0.0704 0.0906 0.1245 0.0886 0.0937 0.0939 0.0837 0.0824 0.1000 0.0798
va: 2.1270 2.0954 3.7493 3.9093 3.8522 3.9041 3.8460 3.9659 3.9724 3.9327 3.9413 3.9136 3.9701 3.6899 3.9242 3.8078 4.2234 3.8844 3.9114 1.0190 1.0128 1.0104 1.0086 1.0077 1.0141 1.0146 1.0169 1.0025 1.0181 0.9983 1.0056 1.0068 1.0057 1.0080 1.0050 1.0056 1.0075 1.0076 1.0047 1.0318 0.9973 1.0398 0.9980 1.0370 0.9942 1.0132 1.0053 1.0129 1.0101
dispcorr: -0.018668499 hartree
energy: -816.431154372284
dipole: -28.88893 28.52288 -0.36605 23.97105 -23.34532 0.62573 -1.52015 1.25840 -0.26175
magnitude: 0.77075 au
magnitude: 1.95908 debye
