program: Orca
programVersion: 5.0.2
elementType: O O C C C C C C C C C C C C C C C C C H H H H H H H H H H H H H H H H H H H H H H H H H H H H H H
charge: 0
multiplicity: 1
keywords: wb97x-d3
keywords: def2-TZVPP
keywords: def2/J RIJCOSX
keywords: DEFGRID2
keywords: scfconv7
keywords: smallprint printgap noloewdin
keywords: NOSOSCF
formula: C17H30O2
InChI: InChI=1/C17H30O2/c1-6-19-17(18)13-16(5)12-8-11-15(4)10-7-9-14(2)3/h8,12-15H,6-7,9-11H2,1-5H3
49 atoms
O  4.133798 -3.624468 0.684648
O  4.501533 -1.567058 -0.112656
C  -3.159813 -0.468268 -0.145716
C  -3.007798 0.717036 -1.105003
C  -3.234166 2.095878 -0.494195
C  -3.10158 3.2115 -1.524286
C  -3.192551 4.627373 -0.953111
C  -2.203409 -0.407394 1.057977
C  -4.59678 -0.635669 0.339032
C  -2.916905 5.658739 -2.04243
C  -4.540494 4.897464 -0.291914
C  -0.767754 -0.263659 0.676035
C  0.139657 -1.236412 0.79456
C  1.548434 -1.142356 0.41755
C  2.022508 0.146505 -0.177568
C  2.312991 -2.230485 0.634328
C  3.747772 -2.387038 0.348939
C  5.501006 -3.977336 0.486935
C  6.390045 -3.502287 1.617747
H  -2.894516 -1.366367 -0.714528
H  -3.710332 0.577096 -1.933348
H  -2.013265 0.686555 -1.561775
H  -2.515055 2.27436 0.313055
H  -4.223083 2.135698 -0.030709
H  -2.140521 3.102593 -2.039183
H  -3.869164 3.087272 -2.2977
H  -2.41339 4.729087 -0.187667
H  -2.335943 -1.314215 1.654293
H  -2.4929 0.427609 1.705208
H  -4.916096 0.199476 0.964824
H  -5.291039 -0.703565 -0.499901
H  -4.709333 -1.544677 0.931885
H  -1.941796 5.501396 -2.506174
H  -2.932609 6.674456 -1.644523
H  -3.669807 5.603543 -2.832086
H  -5.357872 4.757325 -1.003704
H  -4.724992 4.238922 0.556751
H  -4.599201 5.922662 0.076749
H  -0.47047 0.697349 0.267299
H  -0.177649 -2.188308 1.211882
H  1.868338 0.964612 0.528628
H  1.439915 0.383546 -1.069939
H  3.07052 0.12193 -0.447824
H  1.840974 -3.103883 1.068936
H  5.85884 -3.595791 -0.471138
H  5.500137 -5.066182 0.436188
H  6.445852 -2.415932 1.655587
H  6.034299 -3.868269 2.580765
H  7.4013 -3.883176 1.470029
totalener: -816.41271655 hartree
nucrepener: 1380.14670869 hartree
electener: -2196.55942524 hartree
oneelecener: -3845.23296739 hartree
twoeener: 1648.67354215 hartree
kineticenergy: 812.47326033 hartree
xcener: -82.312993268798 hartree
chargesum: -0.0000000
charge: -0.271884 -0.402617 0.088831 -0.169474 -0.148069 -0.154166 0.059533 -0.173930 -0.297857 -0.266165 -0.277463 -0.105504 -0.090217 0.035208 -0.268675 -0.159510 0.413640 0.030498 -0.253886 0.054710 0.079219 0.078465 0.059980 0.079271 0.064713 0.064212 0.025042 0.075785 0.092953 0.074835 0.088551 0.088172 0.080939 0.082601 0.075763 0.078791 0.082158 0.084322 0.094096 0.071189 0.090299 0.087580 0.125412 0.093437 0.083006 0.094465 0.099804 0.081794 0.080145
qa: -0.2719 -0.4026 0.0888 -0.1695 -0.1481 -0.1542 0.0595 -0.1739 -0.2979 -0.2662 -0.2775 -0.1055 -0.0902 0.0352 -0.2687 -0.1595 0.4136 0.0305 -0.2539 0.0547 0.0792 0.0785 0.0600 0.0793 0.0647 0.0642 0.0250 0.0758 0.0930 0.0748 0.0886 0.0882 0.0809 0.0826 0.0758 0.0788 0.0822 0.0843 0.0941 0.0712 0.0903 0.0876 0.1254 0.0934 0.0830 0.0945 0.0998 0.0818 0.0801
va: 2.1275 2.0955 3.7846 3.8931 3.8522 3.8928 3.8443 3.9462 3.9573 3.9436 3.9333 3.8934 3.9819 3.6827 3.9221 3.8092 4.2230 3.8848 3.9120 1.0175 1.0120 1.0096 1.0069 1.0047 1.0159 1.0149 1.0167 1.0182 0.9988 1.0019 1.0061 1.0067 1.0074 1.0076 1.0056 1.0048 1.0048 1.0082 1.0014 1.0322 0.9975 0.9986 1.0400 1.0371 1.0134 0.9941 1.0127 1.0054 1.0101
dispcorr: -0.019208292 hartree
energy: -816.431924839622
dipole: -26.20957 25.53379 -0.67577 21.37990 -21.53642 -0.15652 -3.67568 3.87896 0.20327
magnitude: 0.72283 au
magnitude: 1.83730 debye
