program: Orca
programVersion: 5.0.2
elementType: O O C C C C C C C C C C C C C C C C C H H H H H H H H H H H H H H H H H H H H H H H H H H H H H H
charge: 0
multiplicity: 1
keywords: wb97x-d3
keywords: def2-TZVPP
keywords: def2/J RIJCOSX
keywords: DEFGRID2
keywords: scfconv7
keywords: smallprint printgap noloewdin
keywords: NOSOSCF
formula: C17H30O2
InChI: InChI=1/C17H30O2/c1-6-19-17(18)13-16(5)12-8-11-15(4)10-7-9-14(2)3/h8,12-15H,6-7,9-11H2,1-5H3
49 atoms
O  5.197199 -2.761656 -0.001261
O  4.003459 -3.545783 1.715303
C  -1.999923 1.007133 -0.248182
C  -3.039731 1.705679 -1.125411
C  -3.865747 2.766895 -0.407053
C  -4.960626 3.345231 -1.297369
C  -5.847756 4.414988 -0.651102
C  -1.357854 -0.156798 -1.018874
C  -0.935331 1.969948 0.266427
C  -6.65339 3.870013 0.524897
C  -5.057852 5.65441 -0.240257
C  -0.47623 -1.004662 -0.166746
C  0.825158 -1.209507 -0.382676
C  1.707969 -2.027853 0.445197
C  1.118218 -2.676802 1.658047
C  2.991246 -2.133759 0.049584
C  4.067546 -2.893052 0.704031
C  6.354821 -3.438254 0.481764
C  7.494929 -3.128835 -0.46021
H  -2.525661 0.582225 0.617059
H  -3.719683 0.949625 -1.533708
H  -2.537735 2.155134 -1.990553
H  -3.212681 3.57103 -0.059214
H  -4.30754 2.322512 0.490752
H  -4.497447 3.770041 -2.194719
H  -5.599005 2.528192 -1.65143
H  -6.564256 4.725018 -1.419997
H  -0.797107 0.233621 -1.873975
H  -2.157121 -0.783349 -1.431361
H  -0.407573 2.444152 -0.564852
H  -1.364764 2.762106 0.879115
H  -0.190739 1.456613 0.875102
H  -7.359308 4.615577 0.893841
H  -6.011698 3.59366 1.36348
H  -7.227475 2.985767 0.242379
H  -5.724994 6.448064 0.099535
H  -4.368458 5.442654 0.578865
H  -4.472524 6.05081 -1.071817
H  -0.958211 -1.466944 0.690502
H  1.285267 -0.734257 -1.2446
H  0.297759 -3.33668 1.369532
H  0.697413 -1.918116 2.320643
H  1.842484 -3.255948 2.216625
H  3.289595 -1.611764 -0.852241
H  6.167517 -4.513977 0.528453
H  6.586519 -3.108098 1.497411
H  7.283611 -3.474199 -1.471886
H  7.701302 -2.059547 -0.500194
H  8.399592 -3.630931 -0.117887
totalener: -816.41369665 hartree
nucrepener: 1343.15386137 hartree
electener: -2159.56755801 hartree
oneelecener: -3771.28595797 hartree
twoeener: 1611.71839996 hartree
kineticenergy: 812.48061994 hartree
xcener: -82.313152550659 hartree
chargesum: -0.0000000
charge: -0.267701 -0.394749 0.090712 -0.169565 -0.133615 -0.148605 0.056569 -0.110116 -0.308661 -0.287588 -0.290781 -0.148491 -0.082013 0.035991 -0.266738 -0.151299 0.398413 0.034484 -0.232161 0.035487 0.064427 0.065696 0.069595 0.065902 0.071208 0.070080 0.039942 0.069069 0.088252 0.077147 0.090028 0.098691 0.086828 0.073477 0.086622 0.087614 0.072627 0.087835 0.096813 0.071715 0.089967 0.088988 0.124432 0.093638 0.084270 0.083852 0.082414 0.082633 0.076663
qa: -0.2677 -0.3947 0.0907 -0.1696 -0.1336 -0.1486 0.0566 -0.1101 -0.3087 -0.2876 -0.2908 -0.1485 -0.0820 0.0360 -0.2667 -0.1513 0.3984 0.0345 -0.2322 0.0355 0.0644 0.0657 0.0696 0.0659 0.0712 0.0701 0.0399 0.0691 0.0883 0.0771 0.0900 0.0987 0.0868 0.0735 0.0866 0.0876 0.0726 0.0878 0.0968 0.0717 0.0900 0.0890 0.1244 0.0936 0.0843 0.0839 0.0824 0.0826 0.0767
va: 2.1240 2.1098 3.7618 3.9200 3.8700 3.9020 3.8459 3.9353 3.9550 3.9473 3.9496 3.9100 3.9564 3.6771 3.9220 3.8092 4.2299 3.8829 3.9551 1.0222 1.0155 1.0132 1.0045 1.0067 1.0111 1.0121 1.0093 1.0194 1.0080 1.0058 1.0047 1.0058 1.0071 1.0015 1.0051 1.0075 1.0010 1.0045 1.0112 1.0318 0.9974 0.9978 1.0400 1.0361 0.9990 0.9996 1.0054 1.0054 1.0089
dispcorr: -0.018498099 hartree
energy: -816.432194744213
dipole: -28.51707 28.13442 -0.38264 25.11393 -24.59389 0.52005 -3.25885 2.71495 -0.54390
magnitude: 0.84421 au
magnitude: 2.14582 debye
