program: Orca
programVersion: 5.0.2
elementType: O O C C C C C C C C C C C C C C C C C H H H H H H H H H H H H H H H H H H H H H H H H H H H H H H
charge: 0
multiplicity: 1
keywords: wb97x-d3
keywords: def2-TZVPP
keywords: def2/J RIJCOSX
keywords: DEFGRID2
keywords: scfconv7
keywords: smallprint printgap noloewdin
keywords: NOSOSCF
formula: C17H30O2
InChI: InChI=1/C17H30O2/c1-6-19-17(18)13-16(5)12-8-11-15(4)10-7-9-14(2)3/h8,12-15H,6-7,9-11H2,1-5H3
49 atoms
O  3.91708 -1.387894 1.036597
O  3.442066 -1.648599 -1.129737
C  -4.161334 -0.354371 0.225793
C  -3.625933 1.065142 0.44619
C  -2.541345 1.527352 -0.521187
C  -2.111228 2.967949 -0.272594
C  -1.001371 3.467807 -1.199486
C  -3.205215 -1.454422 0.718373
C  -5.510654 -0.517719 0.920142
C  -0.784983 4.965491 -1.009715
C  0.307662 2.712818 -0.987608
C  -1.924708 -1.568107 -0.036779
C  -0.708563 -1.546869 0.514618
C  0.554997 -1.618218 -0.214319
C  0.488945 -1.77119 -1.701914
C  1.686588 -1.51469 0.509996
C  3.069415 -1.529861 0.010662
C  5.310324 -1.379934 0.734252
C  6.063595 -1.175315 2.027387
H  -4.317065 -0.499241 -0.851091
H  -3.259798 1.150539 1.476293
H  -4.466579 1.763994 0.37509
H  -2.909542 1.433165 -1.54928
H  -1.676249 0.869621 -0.445806
H  -2.984301 3.622149 -0.376098
H  -1.77913 3.075278 0.767394
H  -1.327237 3.303165 -2.234112
H  -3.731257 -2.413299 0.635804
H  -3.002697 -1.309291 1.784363
H  -5.417358 -0.364862 1.997783
H  -6.236789 0.206317 0.54896
H  -5.927339 -1.513902 0.76376
H  -1.700531 5.529653 -1.196612
H  -0.017384 5.34721 -1.685036
H  -0.463819 5.186668 0.011195
H  1.091388 3.089936 -1.646425
H  0.660092 2.826993 0.040589
H  0.213766 1.644041 -1.181743
H  -2.024086 -1.67211 -1.113846
H  -0.63215 -1.432845 1.592351
H  -0.08255 -2.663345 -1.96432
H  1.467515 -1.842468 -2.159433
H  -0.033891 -0.91894 -2.142353
H  1.593275 -1.400116 1.58367
H  5.534923 -0.58262 0.02142
H  5.595262 -2.323172 0.261422
H  5.805086 -0.225339 2.494612
H  5.861157 -1.97382 2.740647
H  7.135191 -1.168507 1.828414
totalener: -816.41228851 hartree
nucrepener: 1441.34721762 hartree
electener: -2257.75950613 hartree
oneelecener: -3967.77086408 hartree
twoeener: 1710.01135795 hartree
kineticenergy: 812.47677506 hartree
xcener: -82.312170847714 hartree
chargesum: -0.0000000
charge: -0.268185 -0.395682 0.066404 -0.174391 -0.037282 -0.164322 0.057926 -0.121884 -0.270457 -0.265261 -0.251570 -0.132238 -0.077486 0.007373 -0.256789 -0.149853 0.404325 0.033977 -0.231713 0.032835 0.061349 0.068533 0.059291 0.006327 0.063836 0.060539 0.022287 0.088975 0.069570 0.081845 0.081969 0.081122 0.078692 0.082087 0.075474 0.085278 0.076692 0.067066 0.105662 0.071356 0.095221 0.126916 0.081698 0.092496 0.083679 0.084648 0.082480 0.082480 0.076705
qa: -0.2682 -0.3957 0.0664 -0.1744 -0.0373 -0.1643 0.0579 -0.1219 -0.2705 -0.2653 -0.2516 -0.1322 -0.0775 0.0074 -0.2568 -0.1499 0.4043 0.0340 -0.2317 0.0328 0.0613 0.0685 0.0593 0.0063 0.0638 0.0605 0.0223 0.0890 0.0696 0.0818 0.0820 0.0811 0.0787 0.0821 0.0755 0.0853 0.0767 0.0671 0.1057 0.0714 0.0952 0.1269 0.0817 0.0925 0.0837 0.0846 0.0825 0.0825 0.0767
va: 2.1257 2.1081 3.7903 3.9328 3.8132 3.9360 3.8579 3.9226 3.9433 3.9365 3.9365 3.9064 3.9224 3.6762 3.9144 3.8060 4.2272 3.8827 3.9548 1.0213 1.0127 1.0100 1.0163 1.0575 1.0141 1.0128 1.0159 1.0059 1.0178 1.0027 1.0079 1.0079 1.0078 1.0080 1.0056 1.0082 1.0075 1.0093 1.0087 1.0313 0.9986 1.0401 0.9959 1.0367 0.9997 0.9988 1.0054 1.0054 1.0088
dispcorr: -0.020595015 hartree
energy: -816.432883525472
dipole: -16.22517 15.66402 -0.56115 16.12650 -16.03040 0.09609 0.26215 0.20711 0.46926
magnitude: 0.73778 au
magnitude: 1.87530 debye
