program: Orca
programVersion: 5.0.2
elementType: O O C C C C C C C C C C C C C C C C C H H H H H H H H H H H H H H H H H H H H H H H H H H H H H H
charge: 0
multiplicity: 1
keywords: wb97x-d3
keywords: def2-TZVPP
keywords: def2/J RIJCOSX
keywords: DEFGRID2
keywords: scfconv7
keywords: smallprint printgap noloewdin
keywords: NOSOSCF
formula: C17H30O2
InChI: InChI=1/C17H30O2/c1-6-19-17(18)13-16(5)12-8-11-15(4)10-7-9-14(2)3/h8,12-15H,6-7,9-11H2,1-5H3
49 atoms
O  4.600893 -3.106693 1.79352
O  4.136756 -3.659874 -0.323203
C  -2.479153 0.419342 -0.022948
C  -3.465205 1.540198 0.314162
C  -3.511761 2.688987 -0.687075
C  -4.580321 3.719165 -0.337617
C  -4.622527 4.944965 -1.251661
C  -1.024105 0.908963 0.045077
C  -2.693326 -0.776341 0.898759
C  -4.971435 4.580254 -2.691066
C  -5.61085 5.973914 -0.712095
C  -0.038742 -0.114026 -0.409416
C  0.941549 -0.61619 0.345485
C  1.915612 -1.619859 -0.076895
C  1.819659 -2.134006 -1.47952
C  2.827536 -2.009016 0.835607
C  3.895673 -3.004546 0.65967
C  5.675513 -4.042953 1.828364
C  6.942965 -3.491213 1.208969
H  -2.678354 0.095912 -1.053071
H  -3.236919 1.930285 1.313219
H  -4.467745 1.105551 0.38845
H  -3.693448 2.279516 -1.685526
H  -2.541175 3.192613 -0.737174
H  -5.565715 3.237882 -0.341088
H  -4.41698 4.055478 0.692198
H  -3.624812 5.400772 -1.247791
H  -0.796261 1.225139 1.06834
H  -0.912062 1.796366 -0.586075
H  -2.029386 -1.604988 0.652614
H  -2.504284 -0.504713 1.940141
H  -3.71905 -1.142041 0.835886
H  -5.945981 4.088337 -2.74127
H  -4.23895 3.908139 -3.138531
H  -5.020703 5.469184 -3.321652
H  -6.623106 5.564134 -0.680692
H  -5.351252 6.287065 0.300434
H  -5.6384 6.867791 -1.337002
H  -0.158931 -0.457314 -1.433336
H  1.037578 -0.261263 1.367806
H  1.910582 -1.308393 -2.18768
H  0.840713 -2.587976 -1.645523
H  2.579858 -2.869668 -1.708815
H  2.789378 -1.554764 1.818858
H  5.383992 -4.975882 1.342286
H  5.82808 -4.248916 2.887794
H  7.756299 -4.204369 1.348478
H  6.82744 -3.323456 0.139815
H  7.23793 -2.554021 1.680551
totalener: -816.41439967 hartree
nucrepener: 1348.42554479 hartree
electener: -2164.83994447 hartree
oneelecener: -3781.82774269 hartree
twoeener: 1616.98779823 hartree
kineticenergy: 812.47562080 hartree
xcener: -82.311929536312 hartree
chargesum: -0.0000000
charge: -0.272826 -0.403672 0.075712 -0.168967 -0.105927 -0.155444 0.054760 -0.122156 -0.285800 -0.275476 -0.265446 -0.151562 -0.079035 0.035120 -0.267658 -0.160407 0.417013 0.031606 -0.254867 0.037490 0.065383 0.068273 0.061053 0.058451 0.062348 0.065170 0.024449 0.069609 0.095414 0.095213 0.075585 0.085275 0.077790 0.082587 0.084124 0.075846 0.080704 0.082712 0.099217 0.072222 0.090699 0.088375 0.123858 0.093722 0.083957 0.093965 0.079558 0.099732 0.082249
qa: -0.2728 -0.4037 0.0757 -0.1690 -0.1059 -0.1554 0.0548 -0.1222 -0.2858 -0.2755 -0.2654 -0.1516 -0.0790 0.0351 -0.2677 -0.1604 0.4170 0.0316 -0.2549 0.0375 0.0654 0.0683 0.0611 0.0585 0.0623 0.0652 0.0244 0.0696 0.0954 0.0952 0.0756 0.0853 0.0778 0.0826 0.0841 0.0758 0.0807 0.0827 0.0992 0.0722 0.0907 0.0884 0.1239 0.0937 0.0840 0.0940 0.0796 0.0997 0.0822
va: 2.1273 2.0937 3.7870 3.9052 3.8600 3.8952 3.8519 3.9222 3.9561 3.9325 3.9400 3.9117 3.9585 3.6819 3.9225 3.8081 4.2224 3.8834 3.9114 1.0211 1.0135 1.0148 1.0125 1.0148 1.0146 1.0135 1.0170 1.0194 1.0089 1.0047 1.0064 1.0075 1.0051 1.0057 1.0077 1.0056 1.0075 1.0076 1.0104 1.0320 0.9972 0.9979 1.0401 1.0368 1.0134 0.9942 1.0102 1.0132 1.0052
dispcorr: -0.018517929 hartree
energy: -816.432917602885
dipole: -29.00469 28.56324 -0.44145 23.20988 -22.65149 0.55838 -5.56606 5.84700 0.28094
magnitude: 0.76525 au
magnitude: 1.94510 debye
