program: Orca
programVersion: 5.0.2
elementType: O O C C C C C C C C C C C C C C C C C H H H H H H H H H H H H H H H H H H H H H H H H H H H H H H
charge: 0
multiplicity: 1
keywords: wb97x-d3
keywords: def2-TZVPP
keywords: def2/J RIJCOSX
keywords: DEFGRID2
keywords: scfconv7
keywords: smallprint printgap noloewdin
keywords: NOSOSCF
formula: C17H30O2
InChI: InChI=1/C17H30O2/c1-6-19-17(18)13-16(5)12-8-11-15(4)10-7-9-14(2)3/h8,12-15H,6-7,9-11H2,1-5H3
49 atoms
O  3.855518 -1.256617 1.162195
O  3.480915 -2.011654 -0.910284
C  -4.062054 -0.293267 -0.271481
C  -3.295387 0.999254 -0.573175
C  -2.800926 1.772363 0.644339
C  -2.22224 3.143602 0.300305
C  -1.033039 3.153765 -0.663419
C  -3.228935 -1.305188 0.530155
C  -5.392044 -0.034194 0.429041
C  -0.590452 4.589589 -0.926216
C  0.13394 2.316231 -0.151161
C  -1.932028 -1.643824 -0.123255
C  -0.735816 -1.467516 0.443465
C  0.557033 -1.75329 -0.172955
C  0.5565 -2.336682 -1.551247
C  1.65402 -1.454264 0.549875
C  3.059002 -1.618793 0.148439
C  5.265081 -1.319369 0.960239
C  5.79435 -0.101617 0.230948
H  -4.288171 -0.75569 -1.240125
H  -3.94402 1.650639 -1.169542
H  -2.444098 0.759613 -1.217202
H  -2.053604 1.183386 1.183374
H  -3.623787 1.923829 1.348799
H  -3.019977 3.764634 -0.122185
H  -1.91899 3.639553 1.229287
H  -1.35827 2.729864 -1.620209
H  -3.821532 -2.220071 0.644577
H  -3.051366 -0.930734 1.542295
H  -5.252422 0.375197 1.430828
H  -6.004009 0.672747 -0.132932
H  -5.967358 -0.955366 0.534677
H  -0.242036 5.0670 -0.007425
H  -1.407655 5.195367 -1.321587
H  0.227621 4.628602 -1.646959
H  0.469557 2.669091 0.827417
H  -0.123577 1.26115 -0.052559
H  0.987146 2.373794 -0.828676
H  -1.998169 -2.043978 -1.131376
H  -0.701422 -1.061824 1.45112
H  1.553475 -2.551482 -1.914306
H  0.079496 -1.646301 -2.249917
H  -0.026507 -3.259127 -1.56785
H  1.511972 -1.038525 1.540553
H  5.535105 -2.234409 0.430134
H  5.686425 -1.375692 1.963852
H  5.520338 0.817891 0.7479
H  6.883144 -0.147011 0.186865
H  5.422065 -0.0520 -0.790596
totalener: -816.41237481 hartree
nucrepener: 1466.93890812 hartree
electener: -2283.35128293 hartree
oneelecener: -4018.96918602 hartree
twoeener: 1735.61790308 hartree
kineticenergy: 812.48107232 hartree
xcener: -82.317527858786 hartree
chargesum: -0.0000000
charge: -0.272120 -0.402381 0.044126 -0.143363 -0.138767 -0.190558 0.053384 -0.141932 -0.295104 -0.269952 -0.236885 -0.094813 -0.141731 0.039001 -0.267400 -0.165084 0.422219 0.031461 -0.254253 0.050511 0.082626 0.074758 0.063274 0.084818 0.070128 0.073968 0.032685 0.092566 0.072863 0.076840 0.088725 0.086615 0.075609 0.080251 0.082891 0.079049 0.042035 0.085317 0.102408 0.087324 0.123946 0.089248 0.091760 0.094790 0.083792 0.093764 0.082708 0.079726 0.099158
qa: -0.2721 -0.4024 0.0441 -0.1434 -0.1388 -0.1906 0.0534 -0.1419 -0.2951 -0.2700 -0.2369 -0.0948 -0.1417 0.0390 -0.2674 -0.1651 0.4222 0.0315 -0.2543 0.0505 0.0826 0.0748 0.0633 0.0848 0.0701 0.0740 0.0327 0.0926 0.0729 0.0768 0.0887 0.0866 0.0756 0.0803 0.0829 0.0790 0.0420 0.0853 0.1024 0.0873 0.1239 0.0892 0.0918 0.0948 0.0838 0.0938 0.0827 0.0797 0.0992
va: 2.1292 2.0954 3.8298 3.8484 3.8591 3.9326 3.8392 3.9251 3.9580 3.9428 3.9308 3.8499 3.9332 3.6289 3.9222 3.7824 4.2189 3.8830 3.9136 1.0117 1.0087 1.0122 1.0083 1.0133 1.0114 1.0128 1.0128 1.0088 1.0089 1.0025 1.0058 1.0066 1.0065 1.0072 1.0072 1.0069 1.0150 1.0123 1.0077 1.0265 1.0391 0.9978 0.9973 1.0379 1.0134 0.9942 1.0053 1.0103 1.0127
dispcorr: -0.022146258 hartree
energy: -816.434521069287
dipole: -16.24099 15.66247 -0.57851 17.45383 -17.24316 0.21068 -1.79645 2.11403 0.31758
magnitude: 0.69276 au
magnitude: 1.76086 debye
