program: Gaussian 09
title: 000006602
version: EM64L-G09RevD.01
frameworkgroup: C1[X(C20H30O2)]
method: RPBEPBE
basis: SDD
operation: Freq
keyword: #pfreq=noraman
keyword: PBEPBE/SDD
title: #p freq=noraman PBEPBE/SDD
converged: YES YES NO NO
title: Mulliken charges:
elementType: O O C C C C C C C C C C C C C C C C C C C C H H H H H H H H H H H H H H H H H H H H H H H H H H H H H H
charge: -0.422091 -0.233766 0.367991 -0.102451 0.225861 -0.266879 -0.489460 -0.510746 -0.459047 -0.447333 0.535817 -0.660990 -0.814939 -0.545955 -0.776908 0.096279 -0.647687 -0.492301 0.574935 -0.250689 -0.699283 -0.701642 0.216998 0.208775 0.199638 0.199200 0.230093 0.218930 0.223651 0.211651 0.205383 0.212868 0.215638 0.225060 0.242165 0.207101 0.235933 0.213915 0.222226 0.220807 0.247867 0.232053 0.232717 0.222979 0.204474 0.374349 0.213541 0.224487 0.209513 0.226495 0.212293 0.210485
chargesum: 0.00000
title: Mulliken charges with hydrogens summed into heavy atoms:
elementType: O O C C C C C C C C C C C C C C C C C C C C
charge: -0.047742 -0.233766 0.367991 0.114547 0.225861 -0.058104 -0.090621 -0.061723 -0.023745 -0.029082 0.535817 -0.220291 -0.129740 -0.109814 -0.076182 0.096279 -0.414971 -0.269322 0.574935 -0.046216 -0.051742 -0.052369
polarizability: 2.69182055e+02 2.51082506e+00 2.02387052e+02 3.31567136e+00 -1.65442824e+00 1.74271888e+02
1716.lowfreq: -13.1090 -0.0007 0.0005 0.0008 3.6549 18.6359 33.2310 38.7242 51.8149
frequency: 32.3792 38.1884 51.8067 61.5061 86.9169 108.5073 130.8091 135.8443 169.4201 179.9629 183.5919 214.4058 215.1825 221.5278 235.3230 248.9787 253.4591 266.7091 281.3873 297.7531 319.0413 325.4489 333.2628 349.8543 365.9564 379.9011 400.8601 430.2698 434.4564 460.3438 484.5387 516.0138 523.0387 543.4650 557.2798 593.6774 601.9882 640.5242 643.9376 671.0315 710.2392 715.3403 742.9400 782.8875 807.2857 822.4874 836.4375 847.0643 862.1256 879.3413 884.8070 894.3478 902.1865 915.7122 925.3333 947.1427 953.0704 966.3990 972.6023 980.9837 984.0358 1002.7402 1016.6989 1028.3966 1044.0534 1055.0600 1078.1455 1085.0923 1098.9765 1108.7542 1110.3228 1124.4129 1142.3592 1152.3688 1156.9228 1170.9323 1181.3176 1191.0777 1198.1638 1209.4016 1222.2337 1227.9699 1254.3977 1259.6534 1275.4778 1279.0824 1293.7560 1303.7077 1305.9806 1307.5906 1329.2865 1329.9986 1331.9188 1337.8771 1344.8458 1355.3334 1358.7462 1374.4102 1379.0364 1389.8880 1391.2976 1393.8487 1400.0721 1453.7709 1456.1787 1460.2084 1462.0752 1463.1754 1466.9646 1469.1469 1470.0801 1476.0233 1479.6856 1484.2160 1488.1032 1493.2014 1496.1485 1631.5406 1634.2846 1675.4763 2925.1856 2945.7997 2949.8899 2954.6557 2956.7034 2970.9876 2971.7516 2975.4041 2977.8421 2985.2560 2989.6491 2995.7980 3010.6664 3011.9601 3025.8313 3032.6176 3034.7006 3046.4957 3049.1319 3063.9452 3070.7921 3074.2659 3077.7693 3079.7599 3095.2319 3097.6563 3100.7206 3101.9218 3120.2413 3505.5177
redmass: 4.5724 6.1258 3.0856 3.3651 3.0966 2.7451 2.6971 1.4487 3.0325 2.1879 1.7941 1.5862 2.7179 1.3319 1.9173 1.2274 2.6529 2.5731 2.5442 3.0233 2.5898 2.7653 2.7339 2.7230 2.3660 2.6271 3.1759 3.0711 2.9215 3.1189 3.6675 3.4724 2.8617 2.2468 2.8882 3.3642 1.3109 2.9607 3.2213 3.2204 3.1955 3.6848 3.2980 1.7888 1.8435 2.5592 2.2701 1.6194 2.1902 1.7214 1.7807 2.3732 2.2426 1.2156 2.3902 1.9211 1.4295 2.1844 2.2177 2.1280 2.0027 2.2928 2.3941 1.9789 1.7448 2.0417 1.6601 2.2454 2.3213 1.8799 2.5112 1.6870 1.8786 1.8585 1.7276 1.8587 1.5887 1.4389 2.2095 1.4868 1.6110 1.3659 1.6660 1.5612 2.0431 1.4798 1.4469 1.8062 1.3423 1.3795 1.4551 1.3128 1.4352 1.4536 1.3996 1.5153 1.5632 1.2000 1.2807 1.8104 1.2926 1.2157 1.1958 1.0848 1.0853 1.0884 1.0837 1.0822 1.0463 1.0547 1.0556 1.0820 1.0460 1.0653 1.0601 1.0565 1.0557 7.8471 8.7623 7.0110 1.0761 1.0790 1.0730 1.0645 1.0669 1.0622 1.0349 1.0407 1.0782 1.0621 1.0592 1.0388 1.0372 1.0883 1.0949 1.0958 1.0989 1.1020 1.1029 1.0997 1.0989 1.1004 1.0970 1.0995 1.0981 1.0898 1.0981 1.0910 1.0980 1.0638
irintensity: 0.5552 0.5830 0.0538 0.2280 0.7196 0.0501 0.6719 0.1071 1.1123 0.3930 0.2106 0.6065 0.7242 0.3667 0.8436 0.1972 0.1474 0.5358 0.5377 2.0248 0.2207 1.3236 1.5557 3.9147 0.5850 2.0882 2.4717 0.2777 2.4483 1.3898 2.2298 3.2237 2.8251 1.7410 3.3391 46.5385 97.4123 7.1623 1.2487 3.2949 8.0558 29.9466 2.8260 6.6164 17.4318 2.1086 5.6881 1.3359 12.9549 13.7265 15.6475 6.3309 1.7355 3.7432 2.3179 7.4042 0.0184 15.9636 21.2276 4.0899 8.3415 104.5945 115.0536 85.2357 4.2028 32.7057 7.8068 0.9109 5.8247 1.1822 1.3478 4.6369 2.6364 26.9224 6.9804 6.7911 11.8813 1.2589 2.8783 2.6178 3.5688 2.1894 1.6009 1.2338 25.3248 7.0589 1.6018 2.7747 1.0730 1.2461 3.6757 1.4454 5.5651 2.3567 0.1955 0.1399 4.1614 17.6598 3.6485 4.2150 2.1474 14.1640 30.3016 1.0893 5.8423 7.8669 10.3528 7.4581 0.3286 16.5867 6.4134 12.1058 13.2227 15.1235 13.5756 1.5416 26.7541 12.1486 180.7825 13.7561 22.3609 4.7001 11.2692 34.3644 77.3256 26.6539 31.9666 36.0125 19.7046 33.6139 28.1214 18.9713 20.5510 16.8357 48.7582 39.8687 44.7499 33.2372 57.1203 2.4756 110.9831 30.0175 27.9537 35.8410 25.5513 42.5186 42.4729 12.6703 18.5305 23.5955
temp: 298.150 k
press: 1.00000 atm
elementType: 8 8 6 6 6 6 6 6 6 6 6 6 6 6 6 6 6 6 6 6 6 6 1 1 1 1 1 1 1 1 1 1 1 1 1 1 1 1 1 1 1 1 1 1 1 1 1 1 1 1 1 1
symmnumber: 1
zpe: 1194359.7 jmol-1
zpe.correction: 0.454908 hartree
zpe.thermalcorrener: 0.477323 hartree
zpe.thermalcorrenthalpy: 0.478268 hartree
zpe.thermalcorrgfe: 0.404955 hartree
zpe.sumelectzpe: -928.858938 hartree
zpe.sumelectthermal: -928.836522 hartree
zpe.sumelectthermalent: -928.835578 hartree
zpe.sumelectthermalfe: -928.908891 hartree
dipole: -0.6862 1.0827 1.0526
dipole: 1.6587
quadrupole: -128.5581 -131.0529 -139.6235
quadrupole: -0.1658 -0.6819 -3.8583
quadrupole: 4.5201 2.0252 -6.5453 -0.1658 -0.6819 -3.8583
hfenergy: -929.3138459 hartree
pointgroup: C01 [X(C20H30O2)]
dipole: 0.2727156 0.4325523 -0.4054188 debye
polarizability: 269.1408524|-2.7492344|202.3331137|3.6534658|2.1328762|174.3670286 unknown
InChI: InChI=1S/C20H30O2/c1-13(2)14-6-8-16-15(12-14)7-9-17-19(16,3)10-5-11-20(17,4)18(21)22/h6,12-13,16-17,21H,5,7-11H2,1-4H3
charge 0 multiplicity 1
52 atoms
O  5.097823 -1.233323 -0.543439
O  3.799794 -1.64546 1.317886
C  0.482326 0.881589 0.086321
C  1.533483 -0.292663 0.237476
C  2.93931 -0.074175 -0.433581
C  -0.679868 0.534008 1.123835
C  1.176458 2.212817 0.506523
C  0.918492 -1.675125 -0.102937
C  3.508744 1.335053 -0.019512
C  2.494197 2.470306 -0.255913
C  -1.276788 -0.83072 0.774624
C  -0.293711 -1.980333 0.820309
C  -0.134488 1.044636 -1.329709
C  -1.777427 1.6281 1.329108
C  2.960305 -0.241824 -1.976823
C  3.922497 -1.068913 0.212003
C  -2.558552 -0.966813 0.319711
C  -3.0774 1.412937 0.572618
C  -3.469451 0.181026 0.130776
C  -4.811792 -0.039482 -0.568107
C  -4.624426 -0.534795 -2.027792
C  -5.721204 -1.014071 0.22841
H  1.760157 -0.324851 1.326534
H  -0.151311 0.424629 2.096476
H  1.393996 2.179733 1.595798
H  0.49138 3.066386 0.342058
H  1.680454 -2.465444 0.032099
H  0.589263 -1.71123 -1.158685
H  4.447372 1.521928 -0.574158
H  3.763412 1.315253 1.060245
H  2.939152 3.425139 0.085858
H  2.296158 2.591488 -1.337947
H  0.090254 -2.11853 1.853243
H  -0.778733 -2.927071 0.517018
H  -0.978911 1.755774 -1.286625
H  0.587987 1.439947 -2.062917
H  -0.531849 0.093363 -1.721863
H  -1.371043 2.631056 1.097195
H  -2.028171 1.666392 2.41208
H  2.333615 0.519551 -2.465196
H  3.989503 -0.143624 -2.357725
H  2.582933 -1.233883 -2.279116
H  -2.914655 -1.968096 0.040667
H  -3.738544 2.281375 0.442689
H  -5.32761 0.94152 -0.609783
H  5.714652 -1.829762 -0.037636
H  -4.114957 -1.516247 -2.055027
H  -4.016116 0.178105 -2.613473
H  -5.603952 -0.650944 -2.528696
H  -5.896801 -0.645154 1.254923
H  -5.265422 -2.019096 0.3037
H  -6.700534 -1.128482 -0.273222
