program: Orca
programVersion: 5.0.2
elementType: O O C C C C C C C C C C C C C C C C C H H H H H H H H H H H H H H H H H H H H H H H H H H H H H H
charge: 0
multiplicity: 1
keywords: wb97x-d3
keywords: def2-TZVPP
keywords: def2/J RIJCOSX
keywords: DEFGRID2
keywords: scfconv7
keywords: smallprint printgap noloewdin
keywords: NOSOSCF
formula: C17H30O2
InChI: InChI=1/C17H30O2/c1-6-19-17(18)13-16(5)12-8-11-15(4)10-7-9-14(2)3/h8,12-15H,6-7,9-11H2,1-5H3
49 atoms
O  4.146832 -3.246688 1.320541
O  4.318263 -1.708426 -0.294453
C  -3.181106 0.058592 0.609443
C  -3.214042 1.177476 -0.434019
C  -4.097109 2.358062 -0.045102
C  -4.294232 3.373777 -1.167551
C  -3.028935 4.068415 -1.676629
C  -2.557154 -1.230471 0.044654
C  -2.481039 0.487625 1.894448
C  -3.375648 4.99752 -2.835352
C  -2.312394 4.835605 -0.570579
C  -1.127538 -1.085777 -0.358081
C  -0.113393 -1.715036 0.240835
C  1.299408 -1.583425 -0.107278
C  1.652518 -0.658625 -1.229941
C  2.174815 -2.311288 0.613308
C  3.637321 -2.352996 0.463374
C  5.559998 -3.43693 1.325337
C  6.285277 -2.377957 2.130043
H  -4.220257 -0.190516 0.8561
H  -3.577932 0.768477 -1.384184
H  -2.193668 1.526184 -0.62566
H  -3.694546 2.85543 0.841104
H  -5.080514 1.978943 0.251518
H  -4.782597 2.872825 -2.010791
H  -4.997891 4.142823 -0.82957
H  -2.342838 3.304852 -2.06023
H  -3.144042 -1.54558 -0.82519
H  -2.649843 -2.027729 0.787349
H  -1.447252 0.781538 1.704267
H  -2.985278 1.330782 2.366659
H  -2.458951 -0.324389 2.623376
H  -4.057208 5.788345 -2.513335
H  -3.861362 4.456825 -3.649373
H  -2.485058 5.477939 -3.243288
H  -2.972825 5.582458 -0.122931
H  -1.964553 4.181213 0.229664
H  -1.4389 5.36175 -0.958554
H  -0.926004 -0.413564 -1.186281
H  -0.339241 -2.386813 1.064506
H  1.154259 -0.977747 -2.14746
H  2.718048 -0.61348 -1.415981
H  1.296861 0.349899 -1.010307
H  1.781056 -2.950569 1.39485
H  5.942869 -3.473869 0.303737
H  5.703601 -4.419919 1.773783
H  7.344892 -2.629305 2.189846
H  6.2018 -1.395471 1.669527
H  5.899215 -2.321535 3.147746
totalener: -816.41233002 hartree
nucrepener: 1392.43720663 hartree
electener: -2208.84953666 hartree
oneelecener: -3869.86734382 hartree
twoeener: 1661.01780717 hartree
kineticenergy: 812.47931989 hartree
xcener: -82.314781010034 hartree
chargesum: -0.0000000
charge: -0.272212 -0.403029 0.133210 -0.195351 -0.140465 -0.173852 0.040576 -0.150454 -0.311954 -0.266364 -0.272075 -0.138380 -0.084880 0.041483 -0.266601 -0.158100 0.412882 0.031497 -0.254868 0.040058 0.077713 0.059227 0.069759 0.076824 0.068522 0.075916 0.033242 0.090568 0.078686 0.087024 0.091910 0.086494 0.076271 0.081229 0.082482 0.080440 0.079015 0.085544 0.100583 0.070660 0.091445 0.125005 0.086796 0.094061 0.083020 0.094220 0.080006 0.100381 0.081839
qa: -0.2722 -0.4030 0.1332 -0.1954 -0.1405 -0.1739 0.0406 -0.1505 -0.3120 -0.2664 -0.2721 -0.1384 -0.0849 0.0415 -0.2666 -0.1581 0.4129 0.0315 -0.2549 0.0401 0.0777 0.0592 0.0698 0.0768 0.0685 0.0759 0.0332 0.0906 0.0787 0.0870 0.0919 0.0865 0.0763 0.0812 0.0825 0.0804 0.0790 0.0855 0.1006 0.0707 0.0914 0.1250 0.0868 0.0941 0.0830 0.0942 0.0800 0.1004 0.0818
va: 2.1275 2.0947 3.7290 3.9291 3.8894 3.9086 3.8282 3.9546 3.9671 3.9411 3.9364 3.8782 3.9266 3.6779 3.9204 3.8089 4.2232 3.8840 3.9109 1.0170 1.0090 1.0049 1.0062 1.0137 1.0117 1.0137 1.0135 1.0079 1.0157 1.0005 1.0061 1.0080 1.0066 1.0070 1.0073 1.0055 1.0043 1.0086 1.0053 1.0323 0.9968 1.0396 0.9986 1.0368 1.0132 0.9943 1.0101 1.0130 1.0055
dispcorr: -0.019736254 hartree
energy: -816.432066277232
dipole: -22.15246 21.46912 -0.68334 23.32588 -23.41963 -0.09376 -2.63080 2.91650 0.28570
magnitude: 0.74657 au
magnitude: 1.89764 debye
