program: Orca
programVersion: 5.0.2
elementType: O O C C C C C C C C C C C C C C C C C H H H H H H H H H H H H H H H H H H H H H H H H H H H H H H
charge: 0
multiplicity: 1
keywords: wb97x-d3
keywords: def2-TZVPP
keywords: def2/J RIJCOSX
keywords: DEFGRID2
keywords: scfconv7
keywords: smallprint printgap noloewdin
keywords: NOSOSCF
formula: C17H30O2
InChI: InChI=1/C17H30O2/c1-6-19-17(18)13-16(5)12-8-11-15(4)10-7-9-14(2)3/h8,12-15H,6-7,9-11H2,1-5H3
49 atoms
O  3.403816 -0.857151 1.186569
O  3.163731 -1.41834 -0.966217
C  -4.214852 -0.153889 0.116649
C  -3.295377 0.960931 0.636068
C  -2.255138 1.463621 -0.37037
C  -0.990884 1.984466 0.302704
C  0.155589 2.323037 -0.649081
C  -3.589824 -1.546981 0.339959
C  -5.581664 -0.105738 0.791154
C  -0.184899 3.487141 -1.572839
C  1.430796 2.611522 0.135468
C  -2.256767 -1.712186 -0.305624
C  -1.093346 -1.690504 0.34998
C  0.227064 -1.675607 -0.273688
C  0.299365 -1.895802 -1.752573
C  1.277946 -1.407947 0.526372
C  2.683549 -1.245676 0.125985
C  4.796528 -0.617199 0.996901
C  5.07143 0.750456 0.40608
H  -4.363144 -0.01134 -0.960751
H  -2.789725 0.59982 1.539066
H  -3.90225 1.80841 0.967549
H  -2.70976 2.237436 -0.995462
H  -1.973375 0.660627 -1.055539
H  -1.226933 2.861884 0.917145
H  -0.63982 1.215843 0.999827
H  0.341681 1.436243 -1.268213
H  -4.279625 -2.3053 -0.044311
H  -3.504587 -1.71771 1.417833
H  -6.085436 0.841331 0.594541
H  -6.234351 -0.906797 0.440363
H  -5.487718 -0.208632 1.874578
H  0.643505 3.713597 -2.245834
H  -0.396903 4.391414 -0.996902
H  -1.057376 3.279204 -2.192932
H  2.270395 2.819386 -0.52996
H  1.304363 3.479191 0.787612
H  1.711709 1.762936 0.761943
H  -2.259816 -1.785175 -1.38941
H  -1.112009 -1.602078 1.432847
H  1.317077 -1.970172 -2.114219
H  -0.187977 -1.071409 -2.279011
H  -0.235929 -2.807006 -2.023591
H  1.086404 -1.253774 1.582026
H  5.237361 -1.400431 0.377524
H  5.227918 -0.69463 1.994751
H  6.147754 0.923511 0.374588
H  4.690975 0.833014 -0.610335
H  4.62463 1.539982 1.010331
totalener: -816.40869223 hartree
nucrepener: 1518.57413820 hartree
electener: -2334.98283043 hartree
oneelecener: -4122.24582353 hartree
twoeener: 1787.26299310 hartree
kineticenergy: 812.47891730 hartree
xcener: -82.314469946734 hartree
chargesum: 0.0000000
charge: -0.270626 -0.399248 0.062631 -0.190973 -0.126092 -0.154038 0.039313 -0.142239 -0.280536 -0.266237 -0.275602 -0.079933 -0.146906 0.036516 -0.258999 -0.191548 0.421263 0.031216 -0.270042 0.046338 0.063511 0.083361 0.087636 0.059405 0.084823 0.063726 0.027327 0.083863 0.075276 0.082927 0.081494 0.083194 0.084844 0.076960 0.081640 0.085914 0.084692 0.069564 0.107905 0.083262 0.127088 0.079970 0.100709 0.100415 0.086621 0.094826 0.088871 0.102082 0.083838
qa: -0.2706 -0.3992 0.0626 -0.1910 -0.1261 -0.1540 0.0393 -0.1422 -0.2805 -0.2662 -0.2756 -0.0799 -0.1469 0.0365 -0.2590 -0.1915 0.4213 0.0312 -0.2700 0.0463 0.0635 0.0834 0.0876 0.0594 0.0848 0.0637 0.0273 0.0839 0.0753 0.0829 0.0815 0.0832 0.0848 0.0770 0.0816 0.0859 0.0847 0.0696 0.1079 0.0833 0.1271 0.0800 0.1007 0.1004 0.0866 0.0948 0.0889 0.1021 0.0838
va: 2.1180 2.0953 3.7644 3.9117 3.8266 3.8746 3.8609 3.9421 3.9572 3.9357 3.9419 3.8176 3.9253 3.6002 3.9098 3.7881 4.1978 3.8814 3.9109 1.0192 1.0134 1.0076 1.0109 1.0154 1.0145 1.0115 1.0183 1.0122 1.0141 1.0067 1.0075 1.0016 1.0072 1.0056 1.0053 1.0048 1.0072 1.0143 1.0038 1.0269 1.0386 0.9989 0.9993 1.0362 1.0130 0.9942 1.0126 1.0104 1.0018
dispcorr: -0.024715790 hartree
energy: -816.433408020575
dipole: -12.97376 12.37028 -0.60348 15.73527 -15.53022 0.20505 -1.47827 1.80927 0.33100
magnitude: 0.71819 au
magnitude: 1.82549 debye
