program: Orca
programVersion: 5.0.2
elementType: O O C C C C C C C C C C C C C C C C C H H H H H H H H H H H H H H H H H H H H H H H H H H H H H H
charge: 0
multiplicity: 1
keywords: wb97x-d3
keywords: def2-TZVPP
keywords: def2/J RIJCOSX
keywords: DEFGRID2
keywords: scfconv7
keywords: smallprint printgap noloewdin
keywords: NOSOSCF
formula: C17H30O2
InChI: InChI=1/C17H30O2/c1-6-19-17(18)13-16(5)12-8-11-15(4)10-7-9-14(2)3/h8,12-15H,6-7,9-11H2,1-5H3
49 atoms
O  4.073237 -1.681325 1.263114
O  3.606177 -2.638136 -0.704748
C  -3.747717 -0.180417 -0.249947
C  -2.879621 1.021323 -0.636326
C  -2.420542 1.899223 0.52315
C  -1.406908 2.964518 0.11106
C  -1.859989 3.940579 -0.977024
C  -3.0079 -1.187043 0.646025
C  -5.063497 0.23825 0.397826
C  -3.11687 4.70571 -0.578352
C  -0.729401 4.905569 -1.31758
C  -1.741955 -1.68767 0.037266
C  -0.527754 -1.530618 0.5706
C  0.729067 -1.993855 -0.014179
C  0.659347 -2.724409 -1.318892
C  1.857333 -1.726832 0.672393
C  3.235445 -2.079635 0.297469
C  5.466473 -1.924787 1.084964
C  6.129221 -0.863873 0.231046
H  -3.99281 -0.70135 -1.183686
H  -3.442992 1.626608 -1.353363
H  -1.997268 0.663952 -1.177367
H  -1.953322 1.279423 1.293644
H  -3.282117 2.369656 1.00503
H  -1.119746 3.540685 0.997902
H  -0.494166 2.462685 -0.227707
H  -2.085555 3.36815 -1.883721
H  -3.676122 -2.036634 0.826406
H  -2.807089 -0.747648 1.626908
H  -4.904942 0.714329 1.366812
H  -5.606305 0.9452 -0.231657
H  -5.714086 -0.622247 0.56184
H  -3.967851 4.043948 -0.410949
H  -3.407811 5.415382 -1.35437
H  -2.954627 5.273348 0.341316
H  -0.459966 5.516682 -0.453001
H  0.167846 4.371967 -1.635314
H  -1.012392 5.584223 -2.123746
H  -1.847738 -2.198393 -0.916041
H  -0.44661 -1.010401 1.521168
H  0.025761 -3.607645 -1.219162
H  1.632141 -3.037753 -1.675747
H  0.201415 -2.089524 -2.079917
H  1.765887 -1.194501 1.611996
H  5.630036 -2.917942 0.662958
H  5.880307 -1.915217 2.093322
H  5.963272 0.132739 0.639867
H  7.205566 -1.037602 0.203816
H  5.762559 -0.886665 -0.793613
totalener: -816.41218241 hartree
nucrepener: 1423.42063304 hartree
electener: -2239.83281545 hartree
oneelecener: -3931.87571539 hartree
twoeener: 1692.04289994 hartree
kineticenergy: 812.47681872 hartree
xcener: -82.315558398391 hartree
chargesum: -0.0000000
charge: -0.272188 -0.402882 0.066283 -0.163154 -0.150836 -0.185737 0.049378 -0.166325 -0.300986 -0.274378 -0.267301 -0.107502 -0.097563 0.033941 -0.266031 -0.160245 0.415064 0.032395 -0.254377 0.051688 0.081218 0.086501 0.079803 0.077120 0.073959 0.074604 0.033008 0.092012 0.075638 0.079524 0.088811 0.087949 0.076330 0.085626 0.080066 0.075667 0.082773 0.081903 0.100427 0.071326 0.091725 0.123749 0.088360 0.094111 0.083812 0.093317 0.082671 0.079781 0.098967
qa: -0.2722 -0.4029 0.0663 -0.1632 -0.1508 -0.1857 0.0494 -0.1663 -0.3010 -0.2744 -0.2673 -0.1075 -0.0976 0.0339 -0.2660 -0.1602 0.4151 0.0324 -0.2544 0.0517 0.0812 0.0865 0.0798 0.0771 0.0740 0.0746 0.0330 0.0920 0.0756 0.0795 0.0888 0.0879 0.0763 0.0856 0.0801 0.0757 0.0828 0.0819 0.1004 0.0713 0.0917 0.1237 0.0884 0.0941 0.0838 0.0933 0.0827 0.0798 0.0990
va: 2.1275 2.0947 3.8062 3.8674 3.8659 3.9233 3.8292 3.9496 3.9576 3.9375 3.9413 3.8555 3.9418 3.6863 3.9192 3.8079 4.2242 3.8829 3.9141 1.0118 1.0082 1.0117 1.0141 1.0038 1.0121 1.0113 1.0140 1.0096 1.0077 0.9994 1.0061 1.0075 1.0049 1.0085 1.0054 1.0066 1.0073 1.0069 1.0086 1.0306 0.9973 1.0397 0.9983 1.0370 1.0137 0.9942 1.0052 1.0104 1.0126
dispcorr: -0.020392793 hartree
energy: -816.432575204325
dipole: -19.58995 19.05053 -0.53942 21.82837 -21.51948 0.30889 -3.57367 3.86953 0.29585
magnitude: 0.68842 au
magnitude: 1.74982 debye
