program: Orca
programVersion: 5.0.2
elementType: O O C C C C C C C C C C C C C C C C C H H H H H H H H H H H H H H H H H H H H H H H H H H H H H H
charge: 0
multiplicity: 1
keywords: wb97x-d3
keywords: def2-TZVPP
keywords: def2/J RIJCOSX
keywords: DEFGRID2
keywords: scfconv7
keywords: smallprint printgap noloewdin
keywords: NOSOSCF
formula: C17H30O2
InChI: InChI=1/C17H30O2/c1-6-19-17(18)13-16(5)12-8-11-15(4)10-7-9-14(2)3/h8,12-15H,6-7,9-11H2,1-5H3
49 atoms
O  3.998823 -0.869013 1.1495
O  3.561793 -1.627004 -0.908994
C  -4.093026 -0.352262 0.151924
C  -3.526989 1.065286 -0.010453
C  -2.720732 1.29817 -1.284139
C  -2.294307 2.750665 -1.483121
C  -1.370662 3.331827 -0.409739
C  -3.105478 -1.313543 0.833366
C  -5.393134 -0.325898 0.950884
C  -0.075626 2.537795 -0.276843
C  -1.073581 4.796216 -0.715888
C  -1.818252 -1.513647 0.110189
C  -0.611588 -1.276567 0.632309
C  0.664606 -1.464762 -0.0531
C  0.625952 -1.970371 -1.461457
C  1.780878 -1.15875 0.6371
C  3.172107 -1.260023 0.171279
C  5.401317 -0.911156 0.896778
C  5.980525 -2.297813 1.089691
H  -4.32024 -0.750291 -0.845201
H  -2.925594 1.310621 0.871889
H  -4.358342 1.779019 -0.007044
H  -3.333282 1.001084 -2.141603
H  -1.844147 0.646787 -1.306873
H  -1.794962 2.840399 -2.454499
H  -3.191943 3.375707 -1.550884
H  -1.891681 3.29573 0.553815
H  -3.597795 -2.287987 0.935035
H  -2.909291 -0.961674 1.851368
H  -5.232287 0.092227 1.947192
H  -6.147667 0.28688 0.456571
H  -5.810317 -1.326311 1.076956
H  0.589071 2.989035 0.461411
H  0.464222 2.507364 -1.226593
H  -0.250218 1.506856 0.03349
H  -0.542351 4.897099 -1.665268
H  -1.989509 5.385298 -0.78714
H  -0.450375 5.247293 0.057729
H  -1.900559 -1.885492 -0.907255
H  -0.55494 -0.904582 1.651709
H  0.102539 -2.92724 -1.503056
H  1.612839 -2.099016 -1.887147
H  0.067535 -1.274718 -2.091902
H  1.667942 -0.797853 1.652807
H  5.832555 -0.215277 1.616365
H  5.619979 -0.538088 -0.105394
H  5.592877 -3.000722 0.354566
H  7.064273 -2.259345 0.97414
H  5.765798 -2.680882 2.087197
totalener: -816.41135428 hartree
nucrepener: 1459.02372572 hartree
electener: -2275.43508000 hartree
oneelecener: -4003.15466032 hartree
twoeener: 1727.71958031 hartree
kineticenergy: 812.47494870 hartree
xcener: -82.314206603513 hartree
chargesum: -0.0000000
charge: -0.272340 -0.403036 0.061730 -0.167273 -0.095387 -0.179376 0.044411 -0.141038 -0.275009 -0.241337 -0.268467 -0.095454 -0.138576 0.027770 -0.263955 -0.156682 0.424190 0.030218 -0.254575 0.035241 0.065233 0.076154 0.072870 0.046863 0.074704 0.069235 0.032648 0.088029 0.070249 0.084143 0.081915 0.081091 0.083941 0.081643 0.049587 0.076509 0.079796 0.081884 0.108734 0.083447 0.090470 0.126795 0.089066 0.093428 0.094462 0.084335 0.099271 0.079729 0.082713
qa: -0.2723 -0.4030 0.0617 -0.1673 -0.0954 -0.1794 0.0444 -0.1410 -0.2750 -0.2413 -0.2685 -0.0955 -0.1386 0.0278 -0.2640 -0.1567 0.4242 0.0302 -0.2546 0.0352 0.0652 0.0762 0.0729 0.0469 0.0747 0.0692 0.0326 0.0880 0.0702 0.0841 0.0819 0.0811 0.0839 0.0816 0.0496 0.0765 0.0798 0.0819 0.1087 0.0834 0.0905 0.1268 0.0891 0.0934 0.0945 0.0843 0.0993 0.0797 0.0827
va: 2.1290 2.0944 3.7845 3.8750 3.8572 3.9292 3.8440 3.9498 3.9468 3.9245 3.9404 3.8517 3.9115 3.6431 3.9161 3.7799 4.2180 3.8826 3.9126 1.0216 1.0117 1.0075 1.0152 1.0277 1.0135 1.0113 1.0124 1.0081 1.0152 1.0020 1.0070 1.0081 1.0112 1.0074 1.0163 1.0068 1.0073 1.0073 1.0042 1.0295 0.9980 1.0395 0.9963 1.0378 0.9943 1.0133 1.0130 1.0103 1.0052
dispcorr: -0.021906825 hartree
energy: -816.433261108091
dipole: -17.45909 16.87603 -0.58306 12.74815 -12.66916 0.07899 -1.70039 2.13300 0.43261
magnitude: 0.73031 au
magnitude: 1.85629 debye
