program: Orca
programVersion: 5.0.2
elementType: O O C C C C C C C C C C C C C C C C C H H H H H H H H H H H H H H H H H H H H H H H H H H H H H H
charge: 0
multiplicity: 1
keywords: wb97x-d3
keywords: def2-TZVPP
keywords: def2/J RIJCOSX
keywords: DEFGRID2
keywords: scfconv7
keywords: smallprint printgap noloewdin
keywords: NOSOSCF
formula: C17H30O2
InChI: InChI=1/C17H30O2/c1-6-19-17(18)13-16(5)12-8-11-15(4)10-7-9-14(2)3/h8,12-15H,6-7,9-11H2,1-5H3
49 atoms
O  4.168881 -1.410284 0.829325
O  3.534657 -2.76804 -0.825082
C  -3.896503 -0.454054 -0.19231
C  -3.203616 0.654506 -0.990766
C  -2.692542 1.837522 -0.176553
C  -2.017564 2.88503 -1.054051
C  -1.446621 4.086769 -0.299752
C  -2.962059 -1.118177 0.830396
C  -5.173617 0.027214 0.488921
C  -0.616725 4.956697 -1.237851
C  -2.536321 4.919236 0.369739
C  -1.737687 -1.699698 0.209617
C  -0.485247 -1.395797 0.559164
C  0.723098 -1.962548 -0.035956
C  0.549177 -2.936936 -1.158798
C  1.904937 -1.566428 0.475835
C  3.247286 -2.000998 0.059256
C  5.535595 -1.71966 0.567472
C  6.378461 -0.981402 1.581084
H  -4.183349 -1.227552 -0.915395
H  -3.904024 1.021672 -1.748559
H  -2.36517 0.222589 -1.546431
H  -1.97327 1.494497 0.574317
H  -3.519919 2.290373 0.375982
H  -1.207437 2.40112 -1.610524
H  -2.727284 3.243059 -1.809849
H  -0.779852 3.705323 0.483425
H  -3.518961 -1.919773 1.329345
H  -2.687984 -0.40716 1.614671
H  -4.966593 0.755694 1.274487
H  -5.850025 0.497395 -0.226448
H  -5.709789 -0.803024 0.95132
H  -1.231849 5.356362 -2.047515
H  0.197445 4.39019 -1.692428
H  -0.175455 5.804689 -0.711909
H  -3.243003 5.302319 -0.370656
H  -3.105009 4.347979 1.103655
H  -2.111101 5.778634 0.890288
H  -1.913147 -2.418426 -0.586413
H  -0.331623 -0.673632 1.356623
H  -0.013674 -2.474394 -1.971696
H  -0.030244 -3.79853 -0.82141
H  1.492124 -3.292936 -1.553788
H  1.892196 -0.853913 1.292621
H  5.798032 -1.420475 -0.450584
H  5.697207 -2.798171 0.636904
H  6.237914 0.096945 1.510653
H  6.142713 -1.291812 2.598807
H  7.43278 -1.19298 1.403927
totalener: -816.41401406 hartree
nucrepener: 1407.46317016 hartree
electener: -2223.87718422 hartree
oneelecener: -3899.92248233 hartree
twoeener: 1676.04529811 hartree
kineticenergy: 812.47631284 hartree
xcener: -82.312917842293 hartree
chargesum: -0.0000000
charge: -0.268192 -0.395187 0.066220 -0.143792 -0.143608 -0.154848 0.057303 -0.162595 -0.303523 -0.265903 -0.274304 -0.114565 -0.090990 0.034574 -0.265874 -0.154434 0.399816 0.034765 -0.232044 0.052088 0.080433 0.077908 0.057995 0.073703 0.069222 0.061068 0.023844 0.092728 0.074636 0.076344 0.090987 0.087714 0.075698 0.081967 0.081440 0.076910 0.080877 0.083520 0.100407 0.071332 0.088230 0.090819 0.124326 0.093412 0.084264 0.083833 0.082440 0.082414 0.076621
qa: -0.2682 -0.3952 0.0662 -0.1438 -0.1436 -0.1548 0.0573 -0.1626 -0.3035 -0.2659 -0.2743 -0.1146 -0.0910 0.0346 -0.2659 -0.1544 0.3998 0.0348 -0.2320 0.0521 0.0804 0.0779 0.0580 0.0737 0.0692 0.0611 0.0238 0.0927 0.0746 0.0763 0.0910 0.0877 0.0757 0.0820 0.0814 0.0769 0.0809 0.0835 0.1004 0.0713 0.0882 0.0908 0.1243 0.0934 0.0843 0.0838 0.0824 0.0824 0.0766
va: 2.1245 2.1090 3.7991 3.8805 3.8718 3.9070 3.8499 3.9400 3.9601 3.9388 3.9309 3.8694 3.9421 3.6900 3.9197 3.8137 4.2286 3.8829 3.9549 1.0121 1.0096 1.0131 1.0112 1.0065 1.0143 1.0147 1.0167 1.0079 1.0067 1.0000 1.0050 1.0073 1.0055 1.0077 1.0077 1.0055 1.0062 1.0076 1.0085 1.0303 0.9985 0.9973 1.0403 1.0362 0.9988 0.9999 1.0053 1.0055 1.0087
dispcorr: -0.019326577 hartree
energy: -816.433340637846
dipole: -19.39131 18.89406 -0.49726 20.93011 -20.56033 0.36978 -0.55565 0.96011 0.40446
magnitude: 0.74000 au
magnitude: 1.88092 debye
