program: Orca
programVersion: 5.0.2
elementType: O O C C C C C C C C C C C C C C C C C H H H H H H H H H H H H H H H H H H H H H H H H H H H H H H
charge: 0
multiplicity: 1
keywords: wb97x-d3
keywords: def2-TZVPP
keywords: def2/J RIJCOSX
keywords: DEFGRID2
keywords: scfconv7
keywords: smallprint printgap noloewdin
keywords: NOSOSCF
formula: C17H30O2
InChI: InChI=1/C17H30O2/c1-6-19-17(18)13-16(5)12-8-11-15(4)10-7-9-14(2)3/h8,12-15H,6-7,9-11H2,1-5H3
49 atoms
O  4.049949 -0.772664 0.579641
O  3.480063 -2.342499 -0.907878
C  -4.002541 -0.42176 -0.122127
C  -3.299199 0.61922 -0.998538
C  -2.674973 1.796192 -0.256625
C  -1.899157 2.710675 -1.198796
C  -1.168643 3.883113 -0.535591
C  -3.055106 -1.067279 0.90305
C  -5.231806 0.142353 0.581554
C  -2.127875 4.849484 0.151935
C  -0.0790 3.415996 0.426221
C  -1.822804 -1.632072 0.282377
C  -0.582489 -1.228111 0.568254
C  0.643766 -1.733002 -0.04345
C  0.509486 -2.797457 -1.086577
C  1.80412 -1.192723 0.377513
C  3.161519 -1.529099 -0.077015
C  5.432842 -0.965028 0.290117
C  6.016531 -2.15487 1.024486
H  -4.343244 -1.218751 -0.794267
H  -4.017585 0.99705 -1.733824
H  -2.516371 0.120998 -1.579298
H  -1.999516 1.423543 0.517903
H  -3.45156 2.364912 0.26236
H  -1.164912 2.107888 -1.74411
H  -2.583894 3.104903 -1.957789
H  -0.674245 4.43381 -1.343745
H  -3.600594 -1.867918 1.414943
H  -2.785527 -0.342519 1.67608
H  -5.768923 -0.636788 1.124955
H  -4.963574 0.915501 1.303247
H  -5.92798 0.584801 -0.132474
H  -2.91092 5.188157 -0.528983
H  -1.601817 5.734428 0.513272
H  -2.615787 4.391202 1.01426
H  -0.497673 2.914935 1.301171
H  0.608436 2.718493 -0.056049
H  0.509343 4.259022 0.791632
H  -1.979434 -2.40501 -0.465183
H  -0.454245 -0.449859 1.315876
H  -0.008732 -3.664923 -0.673794
H  1.464787 -3.122466 -1.478566
H  -0.096983 -2.430708 -1.917102
H  1.75938 -0.423571 1.139934
H  5.913748 -0.043138 0.616988
H  5.587401 -1.062402 -0.786034
H  5.859811 -2.071799 2.099838
H  5.583617 -3.091985 0.679733
H  7.091793 -2.199839 0.847568
totalener: -816.41176996 hartree
nucrepener: 1445.15587509 hartree
electener: -2261.56764505 hartree
oneelecener: -3975.38754214 hartree
twoeener: 1713.81989709 hartree
kineticenergy: 812.48358532 hartree
xcener: -82.317260944146 hartree
chargesum: -0.0000000
charge: -0.272394 -0.403130 0.065852 -0.142337 -0.166082 -0.150016 0.065472 -0.158019 -0.303600 -0.289757 -0.292627 -0.107102 -0.105468 0.047544 -0.268073 -0.169615 0.417945 0.030985 -0.254708 0.053574 0.081540 0.075225 0.048592 0.084771 0.074783 0.071981 0.038846 0.092462 0.073220 0.087344 0.077172 0.089495 0.086324 0.087346 0.072091 0.069129 0.091785 0.089286 0.102237 0.070007 0.090373 0.123897 0.089567 0.094082 0.094497 0.083661 0.082419 0.099739 0.079687
qa: -0.2724 -0.4031 0.0659 -0.1423 -0.1661 -0.1500 0.0655 -0.1580 -0.3036 -0.2898 -0.2926 -0.1071 -0.1055 0.0475 -0.2681 -0.1696 0.4179 0.0310 -0.2547 0.0536 0.0815 0.0752 0.0486 0.0848 0.0748 0.0720 0.0388 0.0925 0.0732 0.0873 0.0772 0.0895 0.0863 0.0873 0.0721 0.0691 0.0918 0.0893 0.1022 0.0700 0.0904 0.1239 0.0896 0.0941 0.0945 0.0837 0.0824 0.0997 0.0797
va: 2.1278 2.0943 3.8045 3.8812 3.8733 3.8941 3.8449 3.9421 3.9617 3.9481 3.9511 3.8553 3.9416 3.6549 3.9200 3.8040 4.2224 3.8835 3.9118 1.0117 1.0098 1.0134 1.0065 1.0013 1.0128 1.0112 1.0098 1.0094 1.0058 1.0068 1.0001 1.0053 1.0049 1.0075 1.0006 1.0000 1.0051 1.0088 1.0073 1.0296 0.9977 1.0397 0.9982 1.0375 0.9943 1.0131 1.0053 1.0131 1.0102
dispcorr: -0.021004506 hartree
energy: -816.432774464406
dipole: -18.27725 17.76521 -0.51205 15.29543 -14.96236 0.33307 1.37417 -1.07878 0.29539
magnitude: 0.67852 au
magnitude: 1.72465 debye
