program: Orca
programVersion: 5.0.2
elementType: O O C C C C C C C C C C C C C C C C C H H H H H H H H H H H H H H H H H H H H H H H H H H H H H H
charge: 0
multiplicity: 1
keywords: wb97x-d3
keywords: def2-TZVPP
keywords: def2/J RIJCOSX
keywords: DEFGRID2
keywords: scfconv7
keywords: smallprint printgap noloewdin
keywords: NOSOSCF
formula: C17H30O2
InChI: InChI=1/C17H30O2/c1-6-19-17(18)13-16(5)12-8-11-15(4)10-7-9-14(2)3/h8,12-15H,6-7,9-11H2,1-5H3
49 atoms
O  4.001874 -0.707948 0.560475
O  3.454073 -2.295271 -0.916747
C  -4.027664 -0.420415 -0.127889
C  -3.30352 0.612011 -0.997117
C  -2.655533 1.771301 -0.247445
C  -1.842554 2.66195 -1.181155
C  -1.077142 3.806681 -0.509392
C  -3.093823 -1.090851 0.894534
C  -5.245384 0.163429 0.579362
C  -2.006368 4.797985 0.183659
C  -0.003951 3.299597 0.4507
C  -1.858378 -1.651035 0.275559
C  -0.620952 -1.245166 0.571192
C  0.610968 -1.733275 -0.042434
C  0.489663 -2.798473 -1.086283
C  1.763653 -1.173263 0.373964
C  3.124563 -1.483889 -0.088233
C  5.386674 -0.875278 0.26478
C  5.99625 -2.052784 0.997912
H  -4.383648 -1.206061 -0.805334
H  -4.01339 1.009055 -1.730522
H  -2.530829 0.101761 -1.580953
H  -2.001059 1.380629 0.535883
H  -3.422228 2.362181 0.261371
H  -1.124883 2.036112 -1.722457
H  -2.508229 3.080755 -1.943891
H  -0.564317 4.346663 -1.313286
H  -3.649534 -1.895831 1.388015
H  -2.826483 -0.380493 1.681595
H  -5.796284 -0.607231 1.121069
H  -4.961109 0.928782 1.303288
H  -5.93423 0.621734 -0.131776
H  -2.78119 5.160792 -0.494245
H  -1.454584 5.666573 0.546373
H  -2.504822 4.350864 1.045785
H  -0.438787 2.807072 1.322651
H  0.661261 2.583461 -0.035473
H  0.61071 4.121315 0.821323
H  -2.009566 -2.41648 -0.480763
H  -0.500225 -0.472733 1.326048
H  -0.021761 -3.670544 -0.67484
H  1.448982 -3.114298 -1.475985
H  -0.117867 -2.437339 -1.918567
H  1.70862 -0.404384 1.136013
H  5.851696 0.055925 0.588191
H  5.537965 -0.971173 -0.812009
H  5.583783 -2.998813 0.652574
H  7.072258 -2.073979 0.821173
H  5.837681 -1.973689 2.073305
totalener: -816.41157378 hartree
nucrepener: 1450.11098417 hartree
electener: -2266.52255796 hartree
oneelecener: -3985.30105837 hartree
twoeener: 1718.77850041 hartree
kineticenergy: 812.48513696 hartree
xcener: -82.317635943968 hartree
chargesum: -0.0000000
charge: -0.272375 -0.403014 0.064550 -0.140988 -0.168340 -0.150213 0.066038 -0.156536 -0.303901 -0.290261 -0.293526 -0.105767 -0.108854 0.050732 -0.268197 -0.172138 0.417943 0.030987 -0.255094 0.053656 0.082064 0.074509 0.048886 0.085821 0.074604 0.073023 0.038798 0.092351 0.072719 0.087463 0.077179 0.089505 0.086415 0.087574 0.072223 0.068630 0.091832 0.089823 0.102778 0.070487 0.090732 0.123941 0.089364 0.094275 0.094471 0.083602 0.099907 0.079879 0.082443
qa: -0.2724 -0.4030 0.0646 -0.1410 -0.1683 -0.1502 0.0660 -0.1565 -0.3039 -0.2903 -0.2935 -0.1058 -0.1089 0.0507 -0.2682 -0.1721 0.4179 0.0310 -0.2551 0.0537 0.0821 0.0745 0.0489 0.0858 0.0746 0.0730 0.0388 0.0924 0.0727 0.0875 0.0772 0.0895 0.0864 0.0876 0.0722 0.0686 0.0918 0.0898 0.1028 0.0705 0.0907 0.1239 0.0894 0.0943 0.0945 0.0836 0.0999 0.0799 0.0824
va: 2.1272 2.0944 3.8077 3.8796 3.8723 3.8926 3.8433 3.9418 3.9621 3.9484 3.9521 3.8531 3.9434 3.6459 3.9203 3.8028 4.2232 3.8838 3.9113 1.0116 1.0097 1.0136 1.0069 1.0014 1.0130 1.0109 1.0099 1.0096 1.0060 1.0067 1.0000 1.0053 1.0048 1.0076 1.0005 1.0000 1.0048 1.0091 1.0070 1.0290 0.9977 1.0396 0.9981 1.0374 0.9943 1.0130 1.0131 1.0102 1.0053
dispcorr: -0.021222587 hartree
energy: -816.432796370216
dipole: -17.87441 17.36162 -0.51279 15.04635 -14.71336 0.33299 1.45274 -1.16431 0.28843
magnitude: 0.67603 au
magnitude: 1.71834 debye
