program: Orca
programVersion: 5.0.2
elementType: O O C C C C C C C C C C C C C C C C C H H H H H H H H H H H H H H H H H H H H H H H H H H H H H H
charge: 0
multiplicity: 1
keywords: wb97x-d3
keywords: def2-TZVPP
keywords: def2/J RIJCOSX
keywords: DEFGRID2
keywords: scfconv7
keywords: smallprint printgap noloewdin
keywords: NOSOSCF
formula: C17H30O2
InChI: InChI=1/C17H30O2/c1-6-19-17(18)13-16(5)12-8-11-15(4)10-7-9-14(2)3/h8,12-15H,6-7,9-11H2,1-5H3
49 atoms
O  3.876344 -0.933216 0.84055
O  3.389656 -2.468271 -0.712412
C  -4.048593 -0.345193 -0.311774
C  -3.209309 0.70044 -1.053014
C  -2.538443 1.756103 -0.180062
C  -1.595223 2.637371 -0.992414
C  -0.74818 3.627767 -0.186913
C  -3.228023 -1.139219 0.72042
C  -5.281559 0.258962 0.350764
C  -1.600107 4.643023 0.567936
C  0.225595 2.923995 0.755642
C  -1.973399 -1.713046 0.154153
C  -0.74655 -1.37586 0.560044
C  0.509559 -1.868496 0.001534
C  0.428869 -2.881108 -1.097082
C  1.64588 -1.357701 0.515084
C  3.025999 -1.674365 0.118629
C  5.271817 -1.083111 0.588599
C  5.731115 -0.263583 -0.600049
H  -4.396591 -1.0593 -1.067909
H  -3.844548 1.196263 -1.794501
H  -2.433916 0.183847 -1.627369
H  -1.974227 1.266096 0.616969
H  -3.295362 2.37137 0.314362
H  -0.918165 1.990298 -1.560369
H  -2.175996 3.191465 -1.737904
H  -0.147833 4.182132 -0.917061
H  -3.856902 -1.949499 1.105244
H  -2.991763 -0.505999 1.580163
H  -5.904706 -0.511991 0.807067
H  -5.010364 0.96508 1.137422
H  -5.897506 0.793588 -0.373743
H  -2.298681 5.152921 -0.097881
H  -0.977843 5.406061 1.038116
H  -2.183408 4.170374 1.360409
H  0.911111 3.637596 1.215312
H  -0.29396 2.412142 1.568207
H  0.826942 2.180379 0.229097
H  -2.098287 -2.423493 -0.65845
H  -0.653205 -0.657135 1.36984
H  1.402984 -3.204916 -1.440984
H  -0.116884 -2.4670 -1.947343
H  -0.128048 -3.756859 -0.75899
H  1.559873 -0.622889 1.30737
H  5.524938 -2.135943 0.451582
H  5.757118 -0.736152 1.5008
H  5.290473 -0.621207 -1.528908
H  5.478646 0.789339 -0.47558
H  6.815029 -0.336901 -0.696359
totalener: -816.41118644 hartree
nucrepener: 1461.38160420 hartree
electener: -2277.79279064 hartree
oneelecener: -4007.83295208 hartree
twoeener: 1730.04016144 hartree
kineticenergy: 812.48104620 hartree
xcener: -82.316774546708 hartree
chargesum: -0.0000000
charge: -0.272183 -0.402443 0.060447 -0.138380 -0.171351 -0.148408 0.065631 -0.153538 -0.302586 -0.289055 -0.296345 -0.105868 -0.112316 0.055650 -0.268863 -0.176308 0.417063 0.030168 -0.253973 0.053029 0.083414 0.073709 0.048953 0.085831 0.073155 0.074286 0.039331 0.092722 0.072199 0.087462 0.077494 0.088724 0.086109 0.087288 0.073299 0.090839 0.067807 0.091926 0.103419 0.071470 0.123401 0.088360 0.092732 0.096062 0.084443 0.094163 0.098802 0.082448 0.079780
qa: -0.2722 -0.4024 0.0604 -0.1384 -0.1714 -0.1484 0.0656 -0.1535 -0.3026 -0.2891 -0.2963 -0.1059 -0.1123 0.0557 -0.2689 -0.1763 0.4171 0.0302 -0.2540 0.0530 0.0834 0.0737 0.0490 0.0858 0.0732 0.0743 0.0393 0.0927 0.0722 0.0875 0.0775 0.0887 0.0861 0.0873 0.0733 0.0908 0.0678 0.0919 0.1034 0.0715 0.1234 0.0884 0.0927 0.0961 0.0844 0.0942 0.0988 0.0824 0.0798
va: 2.1273 2.0953 3.8153 3.8765 3.8727 3.8889 3.8423 3.9396 3.9618 3.9479 3.9548 3.8506 3.9444 3.6314 3.9211 3.8009 4.2284 3.8841 3.9128 1.0118 1.0094 1.0137 1.0077 1.0028 1.0134 1.0109 1.0099 1.0100 1.0062 1.0065 1.0003 1.0055 1.0048 1.0076 1.0004 1.0100 0.9999 1.0041 1.0067 1.0281 1.0395 0.9979 0.9977 1.0363 1.0137 0.9943 1.0127 1.0051 1.0102
dispcorr: -0.021630632 hartree
energy: -816.432817070381
dipole: -16.85301 16.33202 -0.52099 17.80639 -17.37296 0.43342 -1.00175 1.18025 0.17850
magnitude: 0.70082 au
magnitude: 1.78135 debye
