program: Orca
programVersion: 5.0.2
elementType: O O C C C C C C C C C C C C C C C C C H H H H H H H H H H H H H H H H H H H H H H H H H H H H H H
charge: 0
multiplicity: 1
keywords: wb97x-d3
keywords: def2-TZVPP
keywords: def2/J RIJCOSX
keywords: DEFGRID2
keywords: scfconv7
keywords: smallprint printgap noloewdin
keywords: NOSOSCF
formula: C17H30O2
InChI: InChI=1/C17H30O2/c1-6-19-17(18)13-16(5)12-8-11-15(4)10-7-9-14(2)3/h8,12-15H,6-7,9-11H2,1-5H3
49 atoms
O  3.994636 -0.692098 0.549481
O  3.446593 -2.285148 -0.921498
C  -4.031697 -0.42284 -0.131471
C  -3.303397 0.609626 -0.997216
C  -2.653913 1.765845 -0.24404
C  -1.829947 2.652238 -1.172169
C  -1.047871 3.781126 -0.492939
C  -3.101326 -1.093051 0.894521
C  -5.252379 0.161123 0.570474
C  -1.962123 4.77731 0.212704
C  0.023009 3.251306 0.457479
C  -1.864038 -1.652449 0.278558
C  -0.62752 -1.242513 0.572416
C  0.604771 -1.727589 -0.042865
C  0.48432 -2.793439 -1.086187
C  1.756904 -1.164609 0.371204
C  3.11744 -1.47278 -0.093758
C  5.378807 -0.856486 0.249354
C  5.994162 -2.02886 0.985913
H  -4.38472 -1.208513 -0.810431
H  -4.010551 1.009595 -1.731637
H  -2.530593 0.098552 -1.580151
H  -2.006697 1.371596 0.54336
H  -3.420349 2.361019 0.260147
H  -1.121065 2.020585 -1.718305
H  -2.490469 3.08529 -1.93136
H  -0.531301 4.322088 -1.293779
H  -3.658509 -1.898251 1.385895
H  -2.836832 -0.382677 1.682507
H  -5.804692 -0.609219 1.111197
H  -4.971478 0.927888 1.294272
H  -5.938863 0.617723 -0.144042
H  -2.733446 5.1583 -0.459222
H  -1.397425 5.634006 0.583736
H  -2.464612 4.327363 1.071015
H  -0.414211 2.756436 1.326917
H  0.677187 2.531351 -0.038002
H  0.649327 4.061966 0.832895
H  -2.013341 -2.419585 -0.47641
H  -0.507832 -0.469608 1.326934
H  -0.12162 -2.431969 -1.919506
H  -0.028369 -3.665066 -0.675414
H  1.443986 -3.109951 -1.474436
H  1.701703 -0.395728 1.133257
H  5.842316 0.077562 0.56671
H  5.526173 -0.957007 -0.827529
H  5.58019 -2.97727 0.648924
H  7.068957 -2.050413 0.801963
H  5.84276 -1.943587 2.061865
totalener: -816.41150866 hartree
nucrepener: 1451.78975760 hartree
electener: -2268.20126625 hartree
oneelecener: -3988.65938607 hartree
twoeener: 1720.45811982 hartree
kineticenergy: 812.48522271 hartree
xcener: -82.317736923927 hartree
chargesum: 0.0000000
charge: -0.272442 -0.403130 0.063689 -0.140105 -0.169024 -0.150054 0.065782 -0.155688 -0.303598 -0.289915 -0.293992 -0.105506 -0.110411 0.053443 -0.268621 -0.174176 0.418112 0.031163 -0.255101 0.053625 0.082238 0.074277 0.048379 0.085926 0.074235 0.073543 0.038922 0.092321 0.072798 0.087351 0.077314 0.089373 0.086399 0.087402 0.072411 0.068310 0.092223 0.090071 0.102680 0.070669 0.089654 0.090586 0.124058 0.094524 0.094557 0.083591 0.099873 0.079819 0.082444
qa: -0.2724 -0.4031 0.0637 -0.1401 -0.1690 -0.1501 0.0658 -0.1557 -0.3036 -0.2899 -0.2940 -0.1055 -0.1104 0.0534 -0.2686 -0.1742 0.4181 0.0312 -0.2551 0.0536 0.0822 0.0743 0.0484 0.0859 0.0742 0.0735 0.0389 0.0923 0.0728 0.0874 0.0773 0.0894 0.0864 0.0874 0.0724 0.0683 0.0922 0.0901 0.1027 0.0707 0.0897 0.0906 0.1241 0.0945 0.0946 0.0836 0.0999 0.0798 0.0824
va: 2.1272 2.0942 3.8088 3.8789 3.8726 3.8919 3.8429 3.9417 3.9620 3.9485 3.9525 3.8522 3.9438 3.6408 3.9204 3.8035 4.2240 3.8833 3.9116 1.0117 1.0097 1.0138 1.0073 1.0017 1.0131 1.0108 1.0099 1.0097 1.0060 1.0066 1.0000 1.0053 1.0048 1.0076 1.0004 1.0000 1.0046 1.0093 1.0071 1.0288 0.9981 0.9977 1.0396 1.0372 0.9943 1.0131 1.0130 1.0102 1.0053
dispcorr: -0.021309532 hartree
energy: -816.432818188170
dipole: -17.76382 17.25161 -0.51220 14.93621 -14.60269 0.33352 1.49233 -1.20586 0.28648
magnitude: 0.67502 au
magnitude: 1.71577 debye
