program: Orca
programVersion: 5.0.2
elementType: O O C C C C C C C C C C C C C C C C C H H H H H H H H H H H H H H H H H H H H H H H H H H H H H H
charge: 0
multiplicity: 1
keywords: wb97x-d3
keywords: def2-TZVPP
keywords: def2/J RIJCOSX
keywords: DEFGRID2
keywords: scfconv7
keywords: smallprint printgap noloewdin
keywords: NOSOSCF
formula: C17H30O2
InChI: InChI=1/C17H30O2/c1-6-19-17(18)13-16(5)12-8-11-15(4)10-7-9-14(2)3/h8,12-15H,6-7,9-11H2,1-5H3
49 atoms
O  3.950098 -0.625724 0.516878
O  3.42029 -2.245036 -0.931928
C  -4.050814 -0.422079 -0.143655
C  -3.301813 0.605688 -0.997162
C  -2.633393 1.742876 -0.231271
C  -1.773885 2.609765 -1.14562
C  -0.950725 3.698322 -0.449739
C  -3.136741 -1.112404 0.884447
C  -5.26739 0.174739 0.554296
C  -1.826596 4.71736 0.271614
C  0.099537 3.114466 0.492142
C  -1.895322 -1.668466 0.273472
C  -0.661563 -1.255475 0.574775
C  0.575162 -1.726805 -0.042096
C  0.465696 -2.797332 -1.081777
C  1.720341 -1.143603 0.363421
C  3.082727 -1.430552 -0.109677
C  5.334543 -0.766875 0.206313
C  5.978477 -1.919343 0.949816
H  -4.410482 -1.197784 -0.830476
H  -3.998783 1.025118 -1.730379
H  -2.536577 0.086089 -1.582442
H  -2.007631 1.329649 0.563246
H  -3.390618 2.356329 0.264872
H  -1.087266 1.958566 -1.697206
H  -2.415007 3.07718 -1.900918
H  -0.413702 4.231154 -1.24253
H  -3.70458 -1.920423 1.358433
H  -2.877116 -0.413912 1.684581
H  -5.944215 0.642457 -0.162231
H  -5.83238 -0.59001 1.089823
H  -4.980103 0.935684 1.281795
H  -2.582289 5.138252 -0.394196
H  -1.229866 5.545661 0.656712
H  -2.346371 4.272664 1.122296
H  0.721157 2.372277 -0.012428
H  0.760473 3.894237 0.873529
H  -0.35557 2.629982 1.358292
H  -2.038764 -2.432609 -0.485632
H  -0.548203 -0.486279 1.334013
H  1.428924 -3.110499 -1.463851
H  -0.137203 -2.442061 -1.920034
H  -0.045328 -3.669482 -0.670211
H  1.656759 -0.371852 1.121983
H  5.782871 0.179242 0.509357
H  5.474424 -0.876634 -0.870644
H  5.834563 -1.825383 2.026064
H  5.579799 -2.879037 0.626544
H  7.051877 -1.922638 0.756811
totalener: -816.41126602 hartree
nucrepener: 1457.30628771 hartree
electener: -2273.71755373 hartree
oneelecener: -3999.69543519 hartree
twoeener: 1725.97788146 hartree
kineticenergy: 812.48647308 hartree
xcener: -82.318143620742 hartree
chargesum: -0.0000000
charge: -0.272587 -0.403163 0.061833 -0.138348 -0.171621 -0.150073 0.067070 -0.153999 -0.303310 -0.289726 -0.296501 -0.105244 -0.113044 0.057795 -0.269040 -0.178335 0.418552 0.031253 -0.255499 0.053682 0.082738 0.073755 0.048709 0.086441 0.073809 0.074659 0.039156 0.092289 0.072704 0.089120 0.087303 0.077422 0.086384 0.087374 0.072629 0.092353 0.090937 0.067839 0.103017 0.071202 0.123925 0.089888 0.090711 0.095326 0.094636 0.083521 0.082441 0.100066 0.079952
qa: -0.2726 -0.4032 0.0618 -0.1383 -0.1716 -0.1501 0.0671 -0.1540 -0.3033 -0.2897 -0.2965 -0.1052 -0.1130 0.0578 -0.2690 -0.1783 0.4186 0.0313 -0.2555 0.0537 0.0827 0.0738 0.0487 0.0864 0.0738 0.0747 0.0392 0.0923 0.0727 0.0891 0.0873 0.0774 0.0864 0.0874 0.0726 0.0924 0.0909 0.0678 0.1030 0.0712 0.1239 0.0899 0.0907 0.0953 0.0946 0.0835 0.0824 0.1001 0.0800
va: 2.1264 2.0941 3.8124 3.8770 3.8726 3.8900 3.8405 3.9414 3.9619 3.9487 3.9543 3.8508 3.9460 3.6294 3.9210 3.8034 4.2250 3.8832 3.9117 1.0117 1.0096 1.0139 1.0076 1.0022 1.0133 1.0108 1.0099 1.0100 1.0061 1.0053 1.0066 1.0001 1.0048 1.0076 1.0004 1.0041 1.0099 0.9998 1.0069 1.0281 1.0395 0.9980 0.9978 1.0366 0.9944 1.0131 1.0053 1.0130 1.0102
dispcorr: -0.021579535 hartree
energy: -816.432845554261
dipole: -17.35262 16.84091 -0.51171 14.65980 -14.32328 0.33652 1.61174 -1.33424 0.27750
magnitude: 0.67238 au
magnitude: 1.70905 debye
