program: Orca
programVersion: 5.0.2
elementType: O O C C C C C C C C C C C C C C C C C H H H H H H H H H H H H H H H H H H H H H H H H H H H H H H
charge: 0
multiplicity: 1
keywords: wb97x-d3
keywords: def2-TZVPP
keywords: def2/J RIJCOSX
keywords: DEFGRID2
keywords: scfconv7
keywords: smallprint printgap noloewdin
keywords: NOSOSCF
formula: C17H30O2
InChI: InChI=1/C17H30O2/c1-6-19-17(18)13-16(5)12-8-11-15(4)10-7-9-14(2)3/h8,12-15H,6-7,9-11H2,1-5H3
49 atoms
O  5.269853 -2.281542 1.135148
O  4.056071 -3.851195 0.101628
C  -2.073472 0.957568 -0.051291
C  -2.867325 2.249052 -0.25922
C  -4.299082 2.206374 0.261806
C  -5.058221 3.521437 0.097568
C  -5.196398 4.051046 -1.331989
C  -0.729336 1.047633 -0.791805
C  -1.856369 0.639816 1.423966
C  -5.869263 3.042182 -2.256274
C  -5.965117 5.368546 -1.327951
C  0.032098 -0.234528 -0.785428
C  1.252174 -0.393643 -0.266527
C  2.011429 -1.641949 -0.238719
C  1.369372 -2.856221 -0.832298
C  3.231649 -1.602924 0.331377
C  4.181485 -2.715329 0.486226
C  6.315624 -3.217237 1.387171
C  6.041226 -4.072012 2.607582
H  -2.646082 0.135486 -0.50059
H  -2.881599 2.475366 -1.330306
H  -2.330688 3.07975 0.215475
H  -4.298671 1.953752 1.32496
H  -4.840508 1.394207 -0.23363
H  -6.061893 3.400439 0.520517
H  -4.568353 4.288068 0.707649
H  -4.194398 4.256143 -1.725183
H  -0.12379 1.848078 -0.355069
H  -0.924356 1.336581 -1.830931
H  -1.320545 1.453339 1.91954
H  -2.797027 0.492511 1.953775
H  -1.265091 -0.26669 1.555138
H  -5.994448 3.450953 -3.260084
H  -6.861363 2.773653 -1.885059
H  -5.293597 2.12074 -2.352202
H  -6.983996 5.226296 -0.960258
H  -5.485166 6.110048 -0.687287
H  -6.034159 5.793769 -2.330277
H  -0.476128 -1.083203 -1.235072
H  1.737969 0.469358 0.18035
H  1.129717 -2.678735 -1.882411
H  0.426929 -3.066944 -0.323256
H  1.998147 -3.735142 -0.768865
H  3.574649 -0.65624 0.732262
H  7.203097 -2.604181 1.543639
H  6.488187 -3.842393 0.509251
H  6.908914 -4.699427 2.814856
H  5.857853 -3.45648 3.488133
H  5.185692 -4.727195 2.454643
totalener: -816.41329230 hartree
nucrepener: 1355.62721271 hartree
electener: -2172.04050501 hartree
oneelecener: -3796.22423634 hartree
twoeener: 1624.18373134 hartree
kineticenergy: 812.47606744 hartree
xcener: -82.313524766369 hartree
chargesum: -0.0000000
charge: -0.272536 -0.402783 0.083434 -0.178888 -0.125403 -0.185427 0.045417 -0.104394 -0.305313 -0.275239 -0.266780 -0.149108 -0.082095 0.035864 -0.267277 -0.159395 0.416751 0.030627 -0.254364 0.037761 0.066284 0.071635 0.080749 0.069089 0.075954 0.071307 0.033463 0.068972 0.087899 0.076900 0.089779 0.097321 0.085259 0.081289 0.077378 0.076028 0.081600 0.082485 0.097524 0.071805 0.090093 0.089105 0.123647 0.093758 0.094212 0.084158 0.079655 0.082255 0.099545
qa: -0.2725 -0.4028 0.0834 -0.1789 -0.1254 -0.1854 0.0454 -0.1044 -0.3053 -0.2752 -0.2668 -0.1491 -0.0821 0.0359 -0.2673 -0.1594 0.4168 0.0306 -0.2544 0.0378 0.0663 0.0716 0.0807 0.0691 0.0760 0.0713 0.0335 0.0690 0.0879 0.0769 0.0898 0.0973 0.0853 0.0813 0.0774 0.0760 0.0816 0.0825 0.0975 0.0718 0.0901 0.0891 0.1236 0.0938 0.0942 0.0842 0.0797 0.0823 0.0995
va: 2.1275 2.0949 3.7691 3.8945 3.8693 3.9138 3.8289 3.9257 3.9589 3.9384 3.9402 3.9068 3.9584 3.6778 3.9227 3.8060 4.2224 3.8838 3.9121 1.0218 1.0136 1.0125 1.0164 1.0046 1.0122 1.0109 1.0129 1.0192 1.0080 1.0057 1.0062 1.0056 1.0086 1.0050 1.0041 1.0068 1.0070 1.0073 1.0109 1.0318 0.9978 0.9973 1.0399 1.0369 0.9943 1.0132 1.0102 1.0055 1.0130
dispcorr: -0.019039921 hartree
energy: -816.432332218125
dipole: -32.59780 32.24958 -0.34822 19.88430 -19.23036 0.65394 -1.55797 1.69786 0.13989
magnitude: 0.75396 au
magnitude: 1.91643 debye
