program: Orca
programVersion: 5.0.2
elementType: O O C C C C C C C C C C C C C C C C C H H H H H H H H H H H H H H H H H H H H H H H H H H H H H H
charge: 0
multiplicity: 1
keywords: wb97x-d3
keywords: def2-TZVPP
keywords: def2/J RIJCOSX
keywords: DEFGRID2
keywords: scfconv7
keywords: smallprint printgap noloewdin
keywords: NOSOSCF
formula: C17H30O2
InChI: InChI=1/C17H30O2/c1-6-19-17(18)13-16(5)12-8-11-15(4)10-7-9-14(2)3/h8,12-15H,6-7,9-11H2,1-5H3
49 atoms
O  3.857397 -0.832287 0.628514
O  3.309324 -2.4500 -0.808646
C  -4.123251 -0.471859 -0.111299
C  -3.340499 0.545601 -0.946819
C  -2.669571 1.671626 -0.166875
C  -1.79173 2.537854 -1.06203
C  -1.065826 3.67993 -0.34928
C  -3.243695 -1.176763 0.936893
C  -5.347354 0.142762 0.557293
C  -0.062689 3.168616 0.680876
C  -0.367627 4.577859 -1.365605
C  -2.005665 -1.765863 0.350662
C  -0.767169 -1.376893 0.663898
C  0.46556 -1.879632 0.063951
C  0.345039 -2.962432 -0.961761
C  1.618227 -1.312194 0.469952
C  2.97753 -1.62362 0.003613
C  5.234749 -1.004009 0.303977
C  6.030365 -0.030358 1.14148
H  -4.477958 -1.241979 -0.806933
H  -4.015821 0.976638 -1.693316
H  -2.571057 0.015857 -1.51722
H  -2.060978 1.247525 0.634656
H  -3.421315 2.299893 0.321647
H  -1.047822 1.901803 -1.556614
H  -2.409613 2.955233 -1.864697
H  -1.816386 4.28353 0.175768
H  -3.838545 -1.968703 1.40475
H  -2.982315 -0.479788 1.7378
H  -5.066789 0.9001 1.29113
H  -6.000239 0.619342 -0.175444
H  -5.935741 -0.613602 1.079317
H  0.685481 2.525889 0.209944
H  -0.53993 2.592775 1.474276
H  0.467154 3.994505 1.157912
H  0.391454 4.022516 -1.921385
H  -1.073209 4.985691 -2.091208
H  0.130772 5.418876 -0.881048
H  -2.155339 -2.532874 -0.404302
H  -0.645821 -0.602189 1.416305
H  -0.184991 -3.81936 -0.542348
H  1.305606 -3.298472 -1.331005
H  -0.244332 -2.608464 -1.810131
H  1.564025 -0.530178 1.21867
H  5.393896 -0.824161 -0.762242
H  5.541999 -2.033399 0.504901
H  5.74975 1.001369 0.931182
H  5.891042 -0.212575 2.20672
H  7.091885 -0.139348 0.919955
totalener: -816.41328721 hartree
nucrepener: 1448.57331959 hartree
electener: -2264.98660680 hartree
oneelecener: -3982.16995688 hartree
twoeener: 1717.18335008 hartree
kineticenergy: 812.48548694 hartree
xcener: -82.315521155625 hartree
chargesum: -0.0000000
charge: -0.268247 -0.395006 0.056893 -0.138333 -0.135598 -0.155047 0.063615 -0.154547 -0.301615 -0.282630 -0.265807 -0.106133 -0.109622 0.051283 -0.268130 -0.161080 0.400290 0.034648 -0.232559 0.053125 0.082286 0.074764 0.039911 0.075797 0.065605 0.066958 0.022602 0.092555 0.072905 0.078345 0.088786 0.087113 0.081884 0.080005 0.086288 0.077652 0.079554 0.080616 0.102588 0.070477 0.090979 0.124079 0.089369 0.093264 0.084075 0.084272 0.082617 0.082480 0.076673
qa: -0.2682 -0.3950 0.0569 -0.1383 -0.1356 -0.1550 0.0636 -0.1545 -0.3016 -0.2826 -0.2658 -0.1061 -0.1096 0.0513 -0.2681 -0.1611 0.4003 0.0346 -0.2326 0.0531 0.0823 0.0748 0.0399 0.0758 0.0656 0.0670 0.0226 0.0926 0.0729 0.0783 0.0888 0.0871 0.0819 0.0800 0.0863 0.0777 0.0796 0.0806 0.1026 0.0705 0.0910 0.1241 0.0894 0.0933 0.0841 0.0843 0.0826 0.0825 0.0767
va: 2.1237 2.1092 3.8184 3.8759 3.8662 3.8977 3.8479 3.9402 3.9601 3.9343 3.9398 3.8524 3.9446 3.6458 3.9204 3.8083 4.2286 3.8824 3.9553 1.0119 1.0099 1.0128 1.0177 1.0123 1.0153 1.0135 1.0169 1.0101 1.0063 0.9999 1.0056 1.0063 1.0048 1.0033 1.0093 1.0053 1.0075 1.0081 1.0072 1.0291 0.9978 1.0398 0.9979 1.0368 0.9991 0.9996 1.0053 1.0054 1.0088
dispcorr: -0.020712146 hartree
energy: -816.433999359843
dipole: -15.24782 14.69080 -0.55703 17.71313 -17.27630 0.43682 -0.52289 0.85266 0.32977
magnitude: 0.78092 au
magnitude: 1.98495 debye
