program: Orca
programVersion: 5.0.2
elementType: O O C C C C C C C C C C C C C C C C C H H H H H H H H H H H H H H H H H H H H H H H H H H H H H H
charge: 0
multiplicity: 1
keywords: wb97x-d3
keywords: def2-TZVPP
keywords: def2/J RIJCOSX
keywords: DEFGRID2
keywords: scfconv7
keywords: smallprint printgap noloewdin
keywords: NOSOSCF
formula: C17H30O2
InChI: InChI=1/C17H30O2/c1-6-19-17(18)13-16(5)12-8-11-15(4)10-7-9-14(2)3/h8,12-15H,6-7,9-11H2,1-5H3
49 atoms
O  3.954992 -1.248657 1.196415
O  3.510948 -1.404128 -0.985431
C  -4.147674 -0.349082 0.230652
C  -3.640986 1.081962 0.44654
C  -2.591074 1.574811 -0.544519
C  -2.173149 3.016306 -0.269983
C  -0.962081 3.511697 -1.068521
C  -3.170585 -1.423983 0.738006
C  -5.497459 -0.537247 0.917954
C  0.32635 2.803236 -0.658946
C  -1.182728 3.41652 -2.575011
C  -1.868216 -1.487372 0.015894
C  -0.665657 -1.429767 0.59418
C  0.612631 -1.456466 -0.112193
C  0.575017 -1.565986 -1.604877
C  1.731202 -1.362128 0.6334
C  3.121099 -1.345727 0.153712
C  5.351016 -1.208998 0.911115
C  6.088205 -1.099575 2.224997
H  -4.292904 -0.505354 -0.846058
H  -3.249712 1.168703 1.467201
H  -4.49772 1.763328 0.402373
H  -2.992513 1.489541 -1.559333
H  -1.71605 0.925833 -0.506457
H  -3.024622 3.677935 -0.463312
H  -1.949173 3.124064 0.797117
H  -0.840751 4.572468 -0.821324
H  -3.663286 -2.398025 0.631484
H  -3.001606 -1.283762 1.810431
H  -6.242504 0.153417 0.521565
H  -5.881236 -1.549944 0.784841
H  -5.418638 -0.353185 1.991855
H  1.189164 3.231661 -1.171377
H  0.306582 1.738812 -0.901313
H  0.505155 2.888951 0.414231
H  -0.358624 3.877675 -3.121394
H  -1.248654 2.378968 -2.908004
H  -2.102064 3.920385 -2.879179
H  -1.938279 -1.586115 -1.063914
H  -0.613915 -1.325217 1.674314
H  1.562086 -1.597694 -2.048056
H  0.036007 -0.715175 -2.028271
H  0.03247 -2.464894 -1.903309
H  1.621531 -1.285263 1.708929
H  5.577075 -0.35769 0.263985
H  5.649416 -2.110764 0.370578
H  7.161735 -1.066091 2.039959
H  5.814095 -0.192679 2.763416
H  5.886591 -1.954484 2.869797
totalener: -816.41088256 hartree
nucrepener: 1453.38819837 hartree
electener: -2269.79908092 hartree
oneelecener: -3991.87927688 hartree
twoeener: 1722.08019596 hartree
kineticenergy: 812.47556159 hartree
xcener: -82.313571448486 hartree
chargesum: -0.0000000
charge: -0.268327 -0.395758 0.066456 -0.171505 -0.058656 -0.165931 0.052072 -0.126152 -0.272108 -0.254045 -0.283875 -0.127016 -0.077527 0.002646 -0.253852 -0.147691 0.404715 0.034244 -0.232101 0.033526 0.060776 0.070660 0.068709 0.001160 0.074007 0.067592 0.036824 0.088858 0.069674 0.082489 0.080728 0.082431 0.087882 0.055276 0.083175 0.087998 0.072485 0.085853 0.106624 0.071752 0.127532 0.080633 0.095333 0.092493 0.084031 0.084254 0.076791 0.082374 0.082490
qa: -0.2683 -0.3958 0.0665 -0.1715 -0.0587 -0.1659 0.0521 -0.1262 -0.2721 -0.2540 -0.2839 -0.1270 -0.0775 0.0026 -0.2539 -0.1477 0.4047 0.0342 -0.2321 0.0335 0.0608 0.0707 0.0687 0.0012 0.0740 0.0676 0.0368 0.0889 0.0697 0.0825 0.0807 0.0824 0.0879 0.0553 0.0832 0.0880 0.0725 0.0859 0.1066 0.0718 0.1275 0.0806 0.0953 0.0925 0.0840 0.0843 0.0768 0.0824 0.0825
va: 2.1259 2.1075 3.7885 3.9382 3.8075 3.9325 3.8594 3.9300 3.9439 3.9545 3.9481 3.8995 3.9194 3.6786 3.9107 3.8046 4.2254 3.8829 3.9549 1.0218 1.0133 1.0090 1.0106 1.0551 1.0104 1.0108 1.0103 1.0063 1.0176 1.0076 1.0079 1.0026 1.0083 1.0041 1.0081 1.0081 1.0003 1.0047 1.0079 1.0309 1.0408 0.9955 0.9982 1.0365 0.9994 0.9991 1.0087 1.0054 1.0054
dispcorr: -0.021284990 hartree
energy: -816.432167548164
dipole: -16.95130 16.39432 -0.55698 13.51281 -13.40197 0.11084 -1.81636 2.32082 0.50446
magnitude: 0.75960 au
magnitude: 1.93075 debye
