program: Orca
programVersion: 5.0.2
elementType: O O C C C C C C C C C C C C C C C C C H H H H H H H H H H H H H H H H H H H H H H H H H H H H H H
charge: 0
multiplicity: 1
keywords: wb97x-d3
keywords: def2-TZVPP
keywords: def2/J RIJCOSX
keywords: DEFGRID2
keywords: scfconv7
keywords: smallprint printgap noloewdin
keywords: NOSOSCF
formula: C17H30O2
InChI: InChI=1/C17H30O2/c1-6-19-17(18)13-16(5)12-8-11-15(4)10-7-9-14(2)3/h8,12-15H,6-7,9-11H2,1-5H3
49 atoms
O  4.815838 -2.848608 1.654793
O  4.067749 -3.766871 -0.242763
C  -2.238003 0.78608 -0.084269
C  -3.125843 2.023704 0.069052
C  -3.262528 2.871885 -1.190071
C  -4.063262 4.15652 -0.989824
C  -5.49823 3.985799 -0.485963
C  -0.757683 1.16731 -0.239354
C  -2.427799 -0.161496 1.094954
C  -6.161269 5.35064 -0.330724
C  -6.325694 3.090311 -1.401255
C  0.109461 0.004706 -0.584608
C  1.138484 -0.422802 0.150622
C  1.995206 -1.563734 -0.16332
C  1.690708 -2.338615 -1.407066
C  2.995726 -1.831396 0.698444
C  3.982174 -2.918169 0.609259
C  5.849136 -3.826131 1.751685
C  7.055071 -3.477569 0.903542
H  -2.54858 0.261022 -0.997244
H  -2.742921 2.640982 0.891143
H  -4.119396 1.692769 0.387245
H  -3.712638 2.267796 -1.983994
H  -2.273409 3.152782 -1.562276
H  -3.522011 4.802495 -0.289921
H  -4.091131 4.702901 -1.939356
H  -5.465498 3.520311 0.505535
H  -0.406452 1.639938 0.683542
H  -0.656682 1.917307 -1.03048
H  -3.467242 -0.481507 1.178516
H  -1.811396 -1.055845 1.002574
H  -2.157142 0.326887 2.034125
H  -7.172667 5.260412 0.068253
H  -6.232149 5.863581 -1.292733
H  -5.5966 5.995401 0.344684
H  -5.928799 2.075872 -1.456558
H  -7.356186 3.014835 -1.051046
H  -6.353211 3.489434 -2.418222
H  -0.147128 -0.513696 -1.504432
H  1.372278 0.110133 1.068105
H  0.669848 -2.723121 -1.368155
H  2.365437 -3.171733 -1.556158
H  1.750772 -1.68513 -2.279492
H  3.106782 -1.188276 1.563591
H  5.465534 -4.813631 1.488603
H  6.118312 -3.83993 2.807874
H  6.820051 -3.506298 -0.158847
H  7.439589 -2.488099 1.150321
H  7.851131 -4.199814 1.088487
totalener: -816.41314770 hartree
nucrepener: 1357.05379947 hartree
electener: -2173.46694717 hartree
oneelecener: -3799.07323299 hartree
twoeener: 1625.60628582 hartree
kineticenergy: 812.48320618 hartree
xcener: -82.314895328680 hartree
chargesum: 0.0000000
charge: -0.272326 -0.403318 0.073605 -0.176496 -0.120834 -0.186198 0.047788 -0.122259 -0.282518 -0.266738 -0.275541 -0.146553 -0.083303 0.038127 -0.268576 -0.161033 0.416748 0.030915 -0.254997 0.037515 0.070627 0.068079 0.067764 0.078179 0.071129 0.074859 0.033721 0.068541 0.095695 0.084231 0.095346 0.076034 0.082343 0.076236 0.081474 0.077739 0.085323 0.081252 0.097749 0.072338 0.088859 0.124133 0.090645 0.093928 0.083764 0.094060 0.099660 0.082506 0.079778
qa: -0.2723 -0.4033 0.0736 -0.1765 -0.1208 -0.1862 0.0478 -0.1223 -0.2825 -0.2667 -0.2755 -0.1466 -0.0833 0.0381 -0.2686 -0.1610 0.4167 0.0309 -0.2550 0.0375 0.0706 0.0681 0.0678 0.0782 0.0711 0.0749 0.0337 0.0685 0.0957 0.0842 0.0953 0.0760 0.0823 0.0762 0.0815 0.0777 0.0853 0.0813 0.0977 0.0723 0.0889 0.1241 0.0906 0.0939 0.0838 0.0941 0.0997 0.0825 0.0798
va: 2.1272 2.0942 3.7960 3.8931 3.8661 3.9105 3.8263 3.9253 3.9490 3.9405 3.9388 3.9034 3.9602 3.6797 3.9226 3.8079 4.2230 3.8834 3.9122 1.0220 1.0126 1.0117 1.0066 1.0192 1.0108 1.0127 1.0129 1.0204 1.0101 1.0077 1.0052 1.0061 1.0074 1.0066 1.0070 1.0042 1.0089 1.0050 1.0115 1.0320 0.9979 1.0401 0.9973 1.0368 1.0137 0.9943 1.0129 1.0053 1.0102
dispcorr: -0.019076326 hartree
energy: -816.432224024140
dipole: -30.68800 30.29713 -0.39088 21.51719 -20.90379 0.61340 -4.18441 4.42601 0.24160
magnitude: 0.76643 au
magnitude: 1.94811 debye
