program: Orca
programVersion: 5.0.2
elementType: O O C C C C C C C C C C C C C C C C C H H H H H H H H H H H H H H H H H H H H H H H H H H H H H H
charge: 0
multiplicity: 1
keywords: wb97x-d3
keywords: def2-TZVPP
keywords: def2/J RIJCOSX
keywords: DEFGRID2
keywords: scfconv7
keywords: smallprint printgap noloewdin
keywords: NOSOSCF
formula: C17H30O2
InChI: InChI=1/C17H30O2/c1-6-19-17(18)13-16(5)12-8-11-15(4)10-7-9-14(2)3/h8,12-15H,6-7,9-11H2,1-5H3
49 atoms
O  4.372814 -2.242894 1.246339
O  3.867953 -2.699616 -0.879296
C  -3.435779 -0.128142 0.13996
C  -2.583145 1.140764 0.159153
C  -3.179108 2.32136 -0.598874
C  -2.224694 3.508633 -0.665253
C  -2.687515 4.658603 -1.560466
C  -2.686279 -1.305288 0.784115
C  -4.78195 0.067838 0.828551
C  -3.985481 5.291152 -1.068612
C  -1.593646 5.714558 -1.677758
C  -1.42835 -1.666979 0.069342
C  -0.214382 -1.693113 0.625008
C  1.027935 -2.044552 -0.059213
C  0.946571 -2.37328 -1.517434
C  2.155574 -2.044193 0.67848
C  3.516549 -2.368404 0.225029
C  5.745486 -2.523579 0.982868
C  6.514808 -2.317007 2.266456
H  -3.626175 -0.390528 -0.909085
H  -1.600307 0.914563 -0.265656
H  -2.395877 1.429966 1.200585
H  -4.119887 2.627269 -0.134792
H  -3.431078 2.00441 -1.617698
H  -2.04514 3.891029 0.346738
H  -1.252614 3.155638 -1.026409
H  -2.868183 4.247912 -2.561471
H  -3.350919 -2.176948 0.787081
H  -2.47285 -1.075927 1.83299
H  -4.64732 0.366144 1.871015
H  -5.382929 0.835431 0.341759
H  -5.367419 -0.852944 0.822354
H  -3.868307 5.680024 -0.054079
H  -4.813971 4.582564 -1.057322
H  -4.28299 6.125053 -1.706365
H  -1.380135 6.16577 -0.705983
H  -0.662566 5.287137 -2.053224
H  -1.885631 6.518432 -2.355164
H  -1.543621 -1.91874 -0.981522
H  -0.122967 -1.436771 1.676913
H  1.912018 -2.605052 -1.948555
H  0.514087 -1.534562 -2.066209
H  0.286047 -3.22861 -1.672423
H  2.077637 -1.782894 1.727445
H  6.118424 -1.86576 0.193732
H  5.855403 -3.549804 0.623305
H  6.161018 -2.979159 3.056221
H  7.569959 -2.532013 2.098408
H  6.435773 -1.289416 2.620248
totalener: -816.41492869 hartree
nucrepener: 1371.06980217 hartree
electener: -2187.48473085 hartree
oneelecener: -3827.14339408 hartree
twoeener: 1639.65866323 hartree
kineticenergy: 812.47714552 hartree
xcener: -82.311243922136 hartree
chargesum: -0.0000000
charge: -0.268541 -0.395309 0.072160 -0.159219 -0.119114 -0.146856 0.053816 -0.127798 -0.292548 -0.276019 -0.265969 -0.130243 -0.090695 0.041045 -0.266997 -0.152225 0.399467 0.034777 -0.231456 0.034123 0.078233 0.062215 0.064274 0.059872 0.062917 0.063908 0.025293 0.090429 0.070279 0.081364 0.086649 0.083637 0.077502 0.081601 0.083908 0.075431 0.081004 0.081956 0.098043 0.072853 0.125305 0.087552 0.090664 0.093479 0.083871 0.084191 0.082285 0.076439 0.082445
qa: -0.2685 -0.3953 0.0722 -0.1592 -0.1191 -0.1469 0.0538 -0.1278 -0.2925 -0.2760 -0.2660 -0.1302 -0.0907 0.0410 -0.2670 -0.1522 0.3995 0.0348 -0.2315 0.0341 0.0782 0.0622 0.0643 0.0599 0.0629 0.0639 0.0253 0.0904 0.0703 0.0814 0.0866 0.0836 0.0775 0.0816 0.0839 0.0754 0.0810 0.0820 0.0980 0.0729 0.1253 0.0876 0.0907 0.0935 0.0839 0.0842 0.0823 0.0764 0.0824
va: 2.1249 2.1086 3.7860 3.8927 3.8725 3.8971 3.8481 3.9306 3.9566 3.9338 3.9431 3.8948 3.9432 3.6762 3.9205 3.8139 4.2283 3.8826 3.9552 1.0211 1.0145 1.0149 1.0096 1.0098 1.0135 1.0157 1.0166 1.0077 1.0176 1.0030 1.0050 1.0079 1.0051 1.0052 1.0076 1.0057 1.0075 1.0077 1.0110 1.0311 1.0400 0.9979 0.9976 1.0360 0.9994 0.9994 1.0055 1.0088 1.0054
dispcorr: -0.018393906 hartree
energy: -816.433322592828
dipole: -22.64092 22.10145 -0.53947 23.37272 -23.12740 0.24532 -1.71620 2.15231 0.43611
magnitude: 0.73580 au
magnitude: 1.87027 debye
