program: Orca
programVersion: 5.0.2
elementType: O O C C C C C C C C C C C C C C C C C H H H H H H H H H H H H H H H H H H H H H H H H H H H H H H
charge: 0
multiplicity: 1
keywords: wb97x-d3
keywords: def2-TZVPP
keywords: def2/J RIJCOSX
keywords: DEFGRID2
keywords: scfconv7
keywords: smallprint printgap noloewdin
keywords: NOSOSCF
formula: C17H30O2
InChI: InChI=1/C17H30O2/c1-6-19-17(18)13-16(5)12-8-11-15(4)10-7-9-14(2)3/h8,12-15H,6-7,9-11H2,1-5H3
49 atoms
O  4.241361 -1.93095 1.370195
O  3.796563 -2.599885 -0.717553
C  -3.581349 -0.193569 -0.14239
C  -2.772235 1.09836 -0.261904
C  -3.370899 2.131064 -1.211442
C  -2.430227 3.293181 -1.522286
C  -1.978098 4.128398 -0.322102
C  -2.824912 -1.244123 0.686184
C  -4.962236 0.046028 0.458054
C  -1.003786 5.210955 -0.775457
C  -3.15526 4.747949 0.423017
C  -1.548682 -1.684817 0.052201
C  -0.341195 -1.583672 0.613071
C  0.91946 -1.998718 0.001567
C  0.864447 -2.569529 -1.381062
C  2.03862 -1.834789 0.733684
C  3.416339 -2.170621 0.342978
C  5.630062 -2.198876 1.18681
C  6.347343 -1.07188 0.472522
H  -3.716924 -0.602328 -1.152454
H  -1.76023 0.855832 -0.602201
H  -2.653465 1.529218 0.739117
H  -4.313956 2.51557 -0.814219
H  -3.628365 1.637612 -2.154427
H  -1.542306 2.899138 -2.028465
H  -2.915931 3.958363 -2.245182
H  -1.442739 3.472849 0.373578
H  -3.473679 -2.118533 0.812692
H  -2.63445 -0.853039 1.690674
H  -5.557822 0.72893 -0.147248
H  -5.524652 -0.885135 0.543199
H  -4.883401 0.475992 1.459467
H  -1.48542 5.907003 -1.465892
H  -0.140886 4.783837 -1.288439
H  -0.630904 5.792204 0.069094
H  -3.749521 5.379169 -0.241842
H  -3.821865 3.994669 0.844379
H  -2.812749 5.373326 1.248654
H  -1.643968 -2.109194 -0.943544
H  -0.269605 -1.154793 1.608709
H  0.232324 -3.459545 -1.394346
H  1.841603 -2.83774 -1.761671
H  0.413423 -1.84962 -2.066376
H  1.938841 -1.417101 1.728693
H  5.76908 -3.141829 0.654936
H  6.023222 -2.320908 2.196076
H  6.215056 -0.124177 0.994221
H  7.416247 -1.286103 0.43799
H  5.998192 -0.958499 -0.552102
totalener: -816.41360084 hartree
nucrepener: 1399.84451225 hartree
electener: -2216.25811309 hartree
oneelecener: -3884.71356412 hartree
twoeener: 1668.45545103 hartree
kineticenergy: 812.47687745 hartree
xcener: -82.313510632169 hartree
chargesum: -0.0000000
charge: -0.272514 -0.403285 0.071013 -0.169870 -0.131496 -0.180654 0.045825 -0.121197 -0.289492 -0.266521 -0.274052 -0.128621 -0.095749 0.042735 -0.267942 -0.160861 0.416488 0.032047 -0.255003 0.034095 0.087700 0.059060 0.067506 0.077651 0.070295 0.075725 0.035154 0.090364 0.070383 0.088088 0.083850 0.079677 0.075842 0.082287 0.081976 0.079892 0.077675 0.085125 0.096057 0.073108 0.091091 0.124685 0.088120 0.094023 0.083298 0.094435 0.082083 0.080032 0.099870
qa: -0.2725 -0.4033 0.0710 -0.1699 -0.1315 -0.1807 0.0458 -0.1212 -0.2895 -0.2665 -0.2741 -0.1286 -0.0957 0.0427 -0.2679 -0.1609 0.4165 0.0320 -0.2550 0.0341 0.0877 0.0591 0.0675 0.0777 0.0703 0.0757 0.0352 0.0904 0.0704 0.0881 0.0839 0.0797 0.0758 0.0823 0.0820 0.0799 0.0777 0.0851 0.0961 0.0731 0.0911 0.1247 0.0881 0.0940 0.0833 0.0944 0.0821 0.0800 0.0999
va: 2.1276 2.0938 3.7924 3.8616 3.8726 3.9178 3.8276 3.9263 3.9531 3.9400 3.9371 3.8931 3.9472 3.6744 3.9209 3.8108 4.2218 3.8826 3.9129 1.0224 1.0102 1.0138 1.0055 1.0115 1.0117 1.0130 1.0136 1.0079 1.0184 1.0049 1.0083 1.0040 1.0065 1.0072 1.0074 1.0054 1.0040 1.0086 1.0120 1.0313 0.9970 1.0398 0.9983 1.0367 1.0136 0.9942 1.0053 1.0101 1.0129
dispcorr: -0.019410637 hartree
energy: -816.433011478416
dipole: -21.28569 20.75787 -0.52782 22.49614 -22.23608 0.26006 -3.14804 3.50665 0.35862
magnitude: 0.68908 au
magnitude: 1.75151 debye
