program: Orca
programVersion: 5.0.2
elementType: O O C C C C C C C C C C C C C C C C C H H H H H H H H H H H H H H H H H H H H H H H H H H H H H H
charge: 0
multiplicity: 1
keywords: wb97x-d3
keywords: def2-TZVPP
keywords: def2/J RIJCOSX
keywords: DEFGRID2
keywords: scfconv7
keywords: smallprint printgap noloewdin
keywords: NOSOSCF
formula: C17H30O2
InChI: InChI=1/C17H30O2/c1-6-19-17(18)13-16(5)12-8-11-15(4)10-7-9-14(2)3/h8,12-15H,6-7,9-11H2,1-5H3
49 atoms
O  3.858976 -1.642297 1.235456
O  3.454514 -1.719442 -0.962776
C  -4.181484 -0.335154 0.095606
C  -3.667901 1.08552 0.354531
C  -2.491241 1.540966 -0.50178
C  -2.093382 2.985897 -0.226683
C  -0.865034 3.462458 -1.004774
C  -3.25063 -1.435459 0.634025
C  -5.5688 -0.507048 0.708864
C  -0.681497 4.967496 -0.839387
C  0.402684 2.725135 -0.581311
C  -1.939711 -1.556697 -0.066126
C  -0.746906 -1.579533 0.534224
C  0.541893 -1.658286 -0.148679
C  0.528167 -1.739695 -1.643489
C  1.647896 -1.629722 0.620971
C  3.047191 -1.667925 0.170856
C  5.265581 -1.659309 1.001713
C  5.809636 -0.288217 0.657089
H  -4.274632 -0.473804 -0.989359
H  -3.405443 1.179311 1.415088
H  -4.497849 1.782782 0.19557
H  -2.749406 1.433032 -1.561464
H  -1.636535 0.888442 -0.329802
H  -2.941671 3.639331 -0.458888
H  -1.902029 3.114324 0.845726
H  -1.039431 3.258776 -2.06852
H  -3.77514 -2.393102 0.528919
H  -3.095369 -1.290677 1.707903
H  -5.972389 -1.502971 0.520092
H  -5.539083 -0.362833 1.791189
H  -6.274396 0.217797 0.301535
H  -1.560528 5.518132 -1.178271
H  0.175497 5.330818 -1.408552
H  -0.51366 5.228409 0.208211
H  1.270648 3.083885 -1.136361
H  0.605385 2.881596 0.480969
H  0.339748 1.649072 -0.745546
H  -1.994989 -1.628017 -1.148901
H  -0.710122 -1.498456 1.616971
H  1.521348 -1.80769 -2.068519
H  0.035176 -0.858951 -2.061087
H  -0.047523 -2.608495 -1.96765
H  1.518255 -1.566169 1.695025
H  5.513619 -2.379897 0.220205
H  5.696543 -2.015938 1.937113
H  6.896541 -0.336723 0.580895
H  5.425318 0.068731 -0.296536
H  5.562628 0.440874 1.428622
totalener: -816.41175926 hartree
nucrepener: 1448.96180838 hartree
electener: -2265.37356764 hartree
oneelecener: -3983.02916869 hartree
twoeener: 1717.65560105 hartree
kineticenergy: 812.47986830 hartree
xcener: -82.314126783678 hartree
chargesum: -0.0000000
charge: -0.272483 -0.403917 0.065048 -0.175931 -0.032237 -0.166914 0.057812 -0.118368 -0.270123 -0.265502 -0.247815 -0.136117 -0.074938 0.001102 -0.254974 -0.156537 0.422018 0.032983 -0.254253 0.032811 0.060913 0.068101 0.059542 0.005117 0.064363 0.060233 0.021616 0.089645 0.069830 0.081464 0.081304 0.082582 0.079272 0.082310 0.075204 0.084963 0.075160 0.066362 0.104272 0.072544 0.126571 0.081589 0.094752 0.092983 0.083241 0.093615 0.079738 0.099158 0.081891
qa: -0.2725 -0.4039 0.0650 -0.1759 -0.0322 -0.1669 0.0578 -0.1184 -0.2701 -0.2655 -0.2478 -0.1361 -0.0749 0.0011 -0.2550 -0.1565 0.4220 0.0330 -0.2543 0.0328 0.0609 0.0681 0.0595 0.0051 0.0644 0.0602 0.0216 0.0896 0.0698 0.0815 0.0813 0.0826 0.0793 0.0823 0.0752 0.0850 0.0752 0.0664 0.1043 0.0725 0.1266 0.0816 0.0948 0.0930 0.0832 0.0936 0.0797 0.0992 0.0819
va: 2.1290 2.0931 3.7968 3.9346 3.8114 3.9399 3.8581 3.9155 3.9427 3.9347 3.9372 3.9111 3.9190 3.6791 3.9134 3.8000 4.2203 3.8830 3.9129 1.0213 1.0127 1.0104 1.0159 1.0582 1.0141 1.0127 1.0160 1.0052 1.0180 1.0078 1.0031 1.0079 1.0077 1.0080 1.0057 1.0077 1.0077 1.0089 1.0095 1.0311 1.0403 0.9967 0.9983 1.0374 1.0134 0.9943 1.0102 1.0131 1.0053
dispcorr: -0.020931363 hartree
energy: -816.432690627413
dipole: -16.23898 15.65569 -0.58329 17.98834 -17.87512 0.11322 -1.77742 2.15151 0.37409
magnitude: 0.70213 au
magnitude: 1.78466 debye
