program: Orca
programVersion: 5.0.2
elementType: O O C C C C C C C C C C C C C C C C C H H H H H H H H H H H H H H H H H H H H H H H H H H H H H H
charge: 0
multiplicity: 1
keywords: wb97x-d3
keywords: def2-TZVPP
keywords: def2/J RIJCOSX
keywords: DEFGRID2
keywords: scfconv7
keywords: smallprint printgap noloewdin
keywords: NOSOSCF
formula: C17H30O2
InChI: InChI=1/C17H30O2/c1-6-19-17(18)13-16(5)12-8-11-15(4)10-7-9-14(2)3/h8,12-15H,6-7,9-11H2,1-5H3
49 atoms
O  4.005517 -1.15879 1.072325
O  3.48698 -2.636791 -0.52426
C  -3.998357 -0.475198 -0.244141
C  -3.258953 0.621125 -1.017801
C  -2.720821 1.775536 -0.180025
C  -2.001993 2.813635 -1.033633
C  -1.496657 4.040193 -0.271542
C  -3.116393 -1.145911 0.820727
C  -5.294126 0.027327 0.38447
C  -0.455572 3.677663 0.782891
C  -0.931107 5.070337 -1.243839
C  -1.856426 -1.714626 0.261996
C  -0.627927 -1.37045 0.656365
C  0.62121 -1.909056 0.123269
C  0.524886 -2.923087 -0.973222
C  1.766453 -1.449234 0.664031
C  3.13977 -1.837945 0.309146
C  5.397976 -1.388991 0.868505
C  5.950048 -0.588721 -0.293575
H  -4.267024 -1.24778 -0.974988
H  -3.933804 1.017568 -1.783928
H  -2.423861 0.170221 -1.563327
H  -2.034466 1.387559 0.577013
H  -3.536022 2.261846 0.365557
H  -1.156821 2.338606 -1.546344
H  -2.681215 3.148827 -1.825402
H  -2.354301 4.493881 0.240136
H  -3.695944 -1.952619 1.28387
H  -2.887455 -0.438667 1.622649
H  -5.10771 0.766901 1.164921
H  -5.940881 0.491483 -0.361456
H  -5.853829 -0.790475 0.841183
H  0.404535 3.181242 0.326692
H  -0.854349 3.0098 1.546803
H  -0.086415 4.567846 1.29454
H  -0.069721 4.667468 -1.78174
H  -1.67219 5.369324 -1.98675
H  -0.601207 5.97168 -0.725153
H  -1.981474 -2.453198 -0.525273
H  -0.528336 -0.629513 1.445058
H  -0.034602 -3.795068 -0.628941
H  1.494091 -3.255638 -1.322484
H  -0.024622 -2.507618 -1.82011
H  1.694655 -0.711071 1.454426
H  5.592785 -2.453958 0.729931
H  5.868926 -1.079393 1.801435
H  5.525803 -0.912875 -1.242092
H  5.754913 0.476226 -0.168592
H  7.030822 -0.724533 -0.348541
totalener: -816.41345298 hartree
nucrepener: 1430.48877465 hartree
electener: -2246.90222763 hartree
oneelecener: -3946.02216782 hartree
twoeener: 1699.11994019 hartree
kineticenergy: 812.47794638 hartree
xcener: -82.314407884622 hartree
chargesum: -0.0000000
charge: -0.272570 -0.402819 0.060374 -0.142408 -0.130714 -0.154830 0.060346 -0.157552 -0.300804 -0.276916 -0.267757 -0.112179 -0.096000 0.036916 -0.267880 -0.163293 0.416852 0.031427 -0.254466 0.052638 0.079615 0.077655 0.045906 0.072020 0.065871 0.063460 0.023165 0.093024 0.073652 0.077509 0.089460 0.086977 0.080486 0.080420 0.084279 0.076989 0.079990 0.082006 0.101125 0.070685 0.092120 0.123723 0.088182 0.093987 0.083645 0.094394 0.099321 0.082271 0.079700
qa: -0.2726 -0.4028 0.0604 -0.1424 -0.1307 -0.1548 0.0603 -0.1576 -0.3008 -0.2769 -0.2678 -0.1122 -0.0960 0.0369 -0.2679 -0.1633 0.4169 0.0314 -0.2545 0.0526 0.0796 0.0777 0.0459 0.0720 0.0659 0.0635 0.0232 0.0930 0.0737 0.0775 0.0895 0.0870 0.0805 0.0804 0.0843 0.0770 0.0800 0.0820 0.1011 0.0707 0.0921 0.1237 0.0882 0.0940 0.0836 0.0944 0.0993 0.0823 0.0797
va: 2.1281 2.0946 3.8074 3.8844 3.8671 3.9026 3.8500 3.9381 3.9581 3.9315 3.9417 3.8627 3.9407 3.6814 3.9197 3.8070 4.2227 3.8830 3.9133 1.0121 1.0104 1.0118 1.0135 1.0108 1.0144 1.0142 1.0169 1.0088 1.0062 1.0003 1.0056 1.0067 1.0054 1.0041 1.0081 1.0055 1.0074 1.0077 1.0082 1.0304 0.9974 1.0399 0.9980 1.0372 1.0137 0.9942 1.0127 1.0052 1.0102
dispcorr: -0.020080900 hartree
energy: -816.433533882420
dipole: -17.21728 16.64014 -0.57713 19.21006 -18.80521 0.40485 -3.68063 3.93119 0.25056
magnitude: 0.74817 au
magnitude: 1.90170 debye
