program: Orca
programVersion: 5.0.2
elementType: O O C C C C C C C C C C C C C C C C C H H H H H H H H H H H H H H H H H H H H H H H H H H H H H H
charge: 0
multiplicity: 1
keywords: wb97x-d3
keywords: def2-TZVPP
keywords: def2/J RIJCOSX
keywords: DEFGRID2
keywords: scfconv7
keywords: smallprint printgap noloewdin
keywords: NOSOSCF
formula: C17H30O2
InChI: InChI=1/C17H30O2/c1-6-19-17(18)13-16(5)12-8-11-15(4)10-7-9-14(2)3/h8,12-15H,6-7,9-11H2,1-5H3
49 atoms
O  3.4285 -0.524959 0.983083
O  3.145179 -1.351506 -1.073233
C  -4.209568 -0.201866 0.225987
C  -3.290623 0.959756 0.630152
C  -2.358314 1.460909 -0.475177
C  -1.122034 2.152031 0.085143
C  -0.214184 2.823148 -0.946452
C  -3.544446 -1.566194 0.50114
C  -5.543017 -0.139809 0.962696
C  0.97267 3.478497 -0.247587
C  0.275475 1.852113 -2.016085
C  -2.233732 -1.743673 -0.186314
C  -1.049237 -1.640093 0.421569
C  0.248972 -1.651549 -0.246901
C  0.283235 -2.040367 -1.691766
C  1.310677 -1.249034 0.478928
C  2.692999 -1.074603 0.009377
C  4.798712 -0.254969 0.694977
C  5.39364 0.440167 1.897521
H  -4.413531 -0.128308 -0.84926
H  -2.695067 0.651051 1.497332
H  -3.894891 1.800826 0.983002
H  -2.90907 2.144744 -1.130335
H  -2.049012 0.627067 -1.107641
H  -1.433941 2.90494 0.818008
H  -0.536411 1.412468 0.645283
H  -0.794276 3.611025 -1.44281
H  -4.231156 -2.360192 0.190693
H  -3.411988 -1.67137 1.582723
H  -6.076811 0.783651 0.735184
H  -6.193589 -0.973294 0.692814
H  -5.394632 -0.175017 2.044411
H  1.611571 4.008969 -0.955261
H  1.588881 2.727969 0.253847
H  0.648482 4.196895 0.507537
H  0.94526 2.349254 -2.719439
H  0.828645 1.02248 -1.569333
H  -0.545157 1.430355 -2.597762
H  -2.274447 -1.902888 -1.260116
H  -1.033006 -1.460079 1.493124
H  -0.24692 -2.98196 -1.840631
H  1.29134 -2.142323 -2.073227
H  -0.228673 -1.285541 -2.293646
H  1.144868 -0.977969 1.515261
H  4.878873 0.371167 -0.197392
H  5.3260 -1.188403 0.481206
H  4.887157 1.382947 2.104247
H  5.335384 -0.182355 2.790252
H  6.44462 0.660127 1.710889
totalener: -816.40975142 hartree
nucrepener: 1508.03857185 hartree
electener: -2324.44832326 hartree
oneelecener: -4101.17386653 hartree
twoeener: 1776.72554327 hartree
kineticenergy: 812.47682977 hartree
xcener: -82.313201394483 hartree
chargesum: 0.0000000
charge: -0.268917 -0.394514 0.062780 -0.192516 -0.093957 -0.182643 0.080788 -0.145192 -0.282396 -0.269229 -0.276138 -0.077108 -0.151524 0.043378 -0.264147 -0.184845 0.416284 0.027904 -0.231278 0.045725 0.065584 0.081025 0.082352 0.053033 0.080128 0.055831 0.025870 0.082848 0.076007 0.083312 0.081177 0.083507 0.082566 0.072743 0.079148 0.091981 0.059882 0.080736 0.107534 0.083428 0.102580 0.129518 0.083157 0.095602 0.085243 0.090534 0.082774 0.082758 0.076687
qa: -0.2689 -0.3945 0.0628 -0.1925 -0.0940 -0.1826 0.0808 -0.1452 -0.2824 -0.2692 -0.2761 -0.0771 -0.1515 0.0434 -0.2641 -0.1848 0.4163 0.0279 -0.2313 0.0457 0.0656 0.0810 0.0824 0.0530 0.0801 0.0558 0.0259 0.0828 0.0760 0.0833 0.0812 0.0835 0.0826 0.0727 0.0791 0.0920 0.0599 0.0807 0.1075 0.0834 0.1026 0.1295 0.0832 0.0956 0.0852 0.0905 0.0828 0.0828 0.0767
va: 2.1160 2.1048 3.7634 3.9058 3.8074 3.9032 3.8320 3.9474 3.9575 3.9494 3.9399 3.8142 3.9387 3.5889 3.9016 3.8029 4.1901 3.8797 3.9574 1.0191 1.0132 1.0084 1.0124 1.0172 1.0132 1.0122 1.0165 1.0126 1.0134 1.0062 1.0077 1.0018 1.0075 1.0076 1.0078 1.0146 1.0159 1.0007 1.0043 1.0268 1.0008 1.0381 0.9983 1.0378 1.0003 0.9997 1.0046 1.0052 1.0089
dispcorr: -0.023858594 hartree
energy: -816.433610009996
dipole: -12.55514 11.96040 -0.59474 13.29693 -13.02817 0.26875 0.03517 0.38090 0.41607
magnitude: 0.77399 au
magnitude: 1.96733 debye
