program: Orca
programVersion: 5.0.2
elementType: O O C C C C C C C C C C C C C C C C C H H H H H H H H H H H H H H H H H H H H H H H H H H H H H H
charge: 0
multiplicity: 1
keywords: wb97x-d3
keywords: def2-TZVPP
keywords: def2/J RIJCOSX
keywords: DEFGRID2
keywords: scfconv7
keywords: smallprint printgap noloewdin
keywords: NOSOSCF
formula: C17H30O2
InChI: InChI=1/C17H30O2/c1-6-19-17(18)13-16(5)12-8-11-15(4)10-7-9-14(2)3/h8,12-15H,6-7,9-11H2,1-5H3
49 atoms
O  4.022817 -0.736334 0.744446
O  3.506498 -2.319745 -0.748305
C  -4.035813 -0.531256 -0.094512
C  -3.358917 0.537324 -0.958753
C  -2.78098 1.72943 -0.204815
C  -2.081975 2.712223 -1.13675
C  -1.503662 3.950972 -0.450008
C  -3.081249 -1.15013 0.939602
C  -5.29148 -0.010934 0.597199
C  -0.412579 3.595928 0.556046
C  -0.969195 4.932371 -1.487962
C  -1.829492 -1.688741 0.33452
C  -0.601009 -1.26789 0.646019
C  0.645166 -1.755859 0.061182
C  0.548721 -2.826899 -0.979423
C  1.788139 -1.195772 0.503186
C  3.159177 -1.509466 0.0741
C  5.413255 -0.900903 0.474688
C  6.010767 -2.080634 1.214118
H  -4.342631 -1.335663 -0.774095
H  -4.084138 0.895111 -1.697385
H  -2.554418 0.06998 -1.535595
H  -2.070479 1.375235 0.546123
H  -3.570457 2.25321 0.343837
H  -1.276761 2.193412 -1.67086
H  -2.791771 3.03482 -1.906532
H  -2.318644 4.44511 0.093128
H  -3.611739 -1.962892 1.44845
H  -2.837082 -0.417337 1.71362
H  -5.809994 -0.810533 1.128781
H  -5.057776 0.765621 1.327178
H  -5.992392 0.413652 -0.12301
H  0.400669 3.049206 0.072248
H  -0.786382 2.976242 1.371502
H  0.01663 4.492974 1.004892
H  -0.150726 4.488619 -2.059514
H  -1.744082 5.227001 -2.197337
H  -0.587095 5.84079 -1.019963
H  -1.960336 -2.462714 -0.416944
H  -0.499444 -0.490095 1.398132
H  0.039515 -3.701819 -0.571025
H  1.516659 -3.136147 -1.352723
H  -0.049614 -2.475786 -1.822486
H  1.71631 -0.425015 1.26174
H  5.870806 0.029623 0.810548
H  5.584906 -0.992237 -0.599467
H  5.833315 -2.0060 2.286912
H  5.605546 -3.025728 0.857733
H  7.08977 -2.099877 1.056094
totalener: -816.41333217 hartree
nucrepener: 1435.55188237 hartree
electener: -2251.96521453 hartree
oneelecener: -3956.16515428 hartree
twoeener: 1704.19993975 hartree
kineticenergy: 812.48172685 hartree
xcener: -82.315430405789 hartree
chargesum: -0.0000000
charge: -0.272487 -0.403176 0.061713 -0.141373 -0.129942 -0.154472 0.061910 -0.158727 -0.301816 -0.278328 -0.267684 -0.108897 -0.100423 0.040665 -0.267428 -0.165306 0.417523 0.031195 -0.254984 0.053309 0.079961 0.076796 0.041752 0.073246 0.065693 0.063946 0.022942 0.092500 0.073445 0.086902 0.077917 0.089125 0.081908 0.080022 0.084008 0.077473 0.079837 0.081545 0.102325 0.069996 0.090624 0.123721 0.089403 0.093662 0.094364 0.083566 0.082409 0.099816 0.079824
qa: -0.2725 -0.4032 0.0617 -0.1414 -0.1299 -0.1545 0.0619 -0.1587 -0.3018 -0.2783 -0.2677 -0.1089 -0.1004 0.0407 -0.2674 -0.1653 0.4175 0.0312 -0.2550 0.0533 0.0800 0.0768 0.0418 0.0732 0.0657 0.0639 0.0229 0.0925 0.0734 0.0869 0.0779 0.0891 0.0819 0.0800 0.0840 0.0775 0.0798 0.0815 0.1023 0.0700 0.0906 0.1237 0.0894 0.0937 0.0944 0.0836 0.0824 0.0998 0.0798
va: 2.1277 2.0944 3.8083 3.8840 3.8667 3.9009 3.8484 3.9402 3.9594 3.9321 3.9412 3.8584 3.9407 3.6695 3.9197 3.8059 4.2219 3.8838 3.9110 1.0116 1.0103 1.0121 1.0151 1.0113 1.0147 1.0142 1.0168 1.0092 1.0060 1.0065 1.0001 1.0056 1.0053 1.0036 1.0085 1.0053 1.0074 1.0078 1.0075 1.0303 0.9975 1.0399 0.9981 1.0376 0.9943 1.0131 1.0053 1.0132 1.0101
dispcorr: -0.020356659 hartree
energy: -816.433688824106
dipole: -17.30129 16.72739 -0.57391 15.37835 -15.06533 0.31301 -0.95908 1.29690 0.33782
magnitude: 0.73585 au
magnitude: 1.87037 debye
