program: Orca
programVersion: 5.0.2
elementType: O O C C C C C C C C C C C C C C C C C H H H H H H H H H H H H H H H H H H H H H H H H H H H H H H
charge: 0
multiplicity: 1
keywords: wb97x-d3
keywords: def2-TZVPP
keywords: def2/J RIJCOSX
keywords: DEFGRID2
keywords: scfconv7
keywords: smallprint printgap noloewdin
keywords: NOSOSCF
formula: C17H30O2
InChI: InChI=1/C17H30O2/c1-6-19-17(18)13-16(5)12-8-11-15(4)10-7-9-14(2)3/h8,12-15H,6-7,9-11H2,1-5H3
49 atoms
O  3.470654 -0.618962 1.005793
O  3.15461 -1.312879 -1.093662
C  -4.21045 -0.21836 0.236886
C  -3.299847 0.948731 0.643858
C  -2.383898 1.467322 -0.466461
C  -1.157772 2.182533 0.085449
C  -0.268457 2.864579 -0.955294
C  -3.529716 -1.578291 0.494873
C  -5.539036 -0.175978 0.983847
C  0.899979 3.562247 -0.267323
C  0.247913 1.891245 -2.009892
C  -2.218399 -1.73452 -0.196396
C  -1.033189 -1.632904 0.410716
C  0.263881 -1.630868 -0.260641
C  0.291867 -1.980262 -1.715622
C  1.33122 -1.260225 0.47424
C  2.715221 -1.090691 0.006942
C  4.844331 -0.363694 0.721971
C  5.467929 0.237245 1.959479
H  -4.423528 -0.137458 -0.836035
H  -2.692895 0.63866 1.502412
H  -3.909181 1.78085 1.009016
H  -2.951684 2.140277 -1.118292
H  -2.062983 0.639154 -1.100367
H  -1.479872 2.933083 0.81628
H  -0.555471 1.456375 0.645578
H  -0.869796 3.628846 -1.462948
H  -4.20843 -2.375747 0.17556
H  -3.394789 -1.695257 1.574885
H  -5.3826 -0.219662 2.064082
H  -6.083418 0.744247 0.768601
H  -6.183587 -1.013166 0.710883
H  1.537249 2.836905 0.244316
H  0.556525 4.28251 0.477323
H  1.523394 4.099531 -0.9837
H  0.821777 1.083062 -1.550357
H  -0.560694 1.439805 -2.58571
H  0.905193 2.394956 -2.720073
H  -2.259416 -1.87739 -1.272379
H  -1.015798 -1.470239 1.484969
H  -0.226017 -1.211371 -2.293722
H  -0.235997 -2.919439 -1.887059
H  1.29799 -2.0684 -2.105556
H  1.171442 -1.021935 1.519464
H  4.931162 0.317031 -0.128027
H  5.346629 -1.293055 0.442047
H  4.987862 1.176557 2.232361
H  5.403963 -0.439583 2.810771
H  6.52216 0.442584 1.774595
totalener: -816.41002645 hartree
nucrepener: 1503.72438078 hartree
electener: -2320.13440722 hartree
oneelecener: -4092.54936708 hartree
twoeener: 1772.41495986 hartree
kineticenergy: 812.48160599 hartree
xcener: -82.314248033880 hartree
chargesum: 0.0000000
charge: -0.269015 -0.395604 0.062501 -0.190691 -0.095356 -0.179726 0.081101 -0.146653 -0.282532 -0.270121 -0.279137 -0.076340 -0.148696 0.038825 -0.264356 -0.179412 0.416591 0.030287 -0.231359 0.045792 0.065595 0.080713 0.081693 0.052952 0.079039 0.055161 0.025594 0.083083 0.075958 0.083457 0.083297 0.081263 0.075187 0.078705 0.082517 0.062865 0.080206 0.092125 0.107556 0.082168 0.083058 0.102232 0.129341 0.095032 0.084545 0.088450 0.082779 0.082747 0.076583
qa: -0.2690 -0.3956 0.0625 -0.1907 -0.0954 -0.1797 0.0811 -0.1467 -0.2825 -0.2701 -0.2791 -0.0763 -0.1487 0.0388 -0.2644 -0.1794 0.4166 0.0303 -0.2314 0.0458 0.0656 0.0807 0.0817 0.0530 0.0790 0.0552 0.0256 0.0831 0.0760 0.0835 0.0833 0.0813 0.0752 0.0787 0.0825 0.0629 0.0802 0.0921 0.1076 0.0822 0.0831 0.1022 0.1293 0.0950 0.0845 0.0884 0.0828 0.0827 0.0766
va: 2.1201 2.1030 3.7632 3.9048 3.8098 3.9023 3.8317 3.9489 3.9577 3.9481 3.9409 3.8146 3.9372 3.5938 3.9021 3.7977 4.1937 3.8816 3.9563 1.0190 1.0133 1.0085 1.0127 1.0174 1.0132 1.0127 1.0166 1.0124 1.0132 1.0018 1.0062 1.0076 1.0063 1.0077 1.0076 1.0153 1.0004 1.0146 1.0041 1.0273 0.9985 1.0006 1.0384 1.0378 1.0002 0.9993 1.0049 1.0053 1.0088
dispcorr: -0.023615117 hartree
energy: -816.433641563009
dipole: -12.70412 12.11619 -0.58793 13.23448 -13.00268 0.23180 0.13485 0.29523 0.43008
magnitude: 0.76444 au
magnitude: 1.94305 debye
